ResultSUCCESS
Tests 13 failed / 886 succeeded
Started2019-09-04 10:26
Elapsed1h51m
Work namespaceci-op-f5v5njib
pod4.2.0-0.nightly-2019-09-04-102339-azure
repo/
repos{u'/': u''}

Test Failures


openshift-tests Monitor cluster while tests execute 50m8s

go run hack/e2e.go -v -test --test_args='--ginkgo.focus=openshift\-tests\sMonitor\scluster\swhile\stests\sexecute$'
2 error level events were detected during this test run:

Sep 04 11:23:13.366 E ns/openshift-authentication pod/oauth-openshift-7d799ddfd9-z8zml node/ci-op-f5v5njib-282fe-m65cq-master-1 container=oauth-openshift container exited with code 137 (ContainerStatusUnknown): The container could not be located when the pod was terminated
Sep 04 11:29:01.874 E kube-apiserver Kube API started failing: Get https://api.ci-op-f5v5njib-282fe.ci.azure.devcluster.openshift.com:6443/api/v1/namespaces/kube-system?timeout=3s: context deadline exceeded (Client.Timeout exceeded while awaiting headers)

				
				Click to see stdout/stderrfrom junit_e2e_20190904-120149.xml

Find was mentions in log files


openshift-tests [k8s.io] Variable Expansion should allow substituting values in a container's args [NodeConformance] [Conformance] [Suite:openshift/conformance/parallel/minimal] [Suite:k8s] 1m2s

go run hack/e2e.go -v -test --test_args='--ginkgo.focus=openshift\-tests\s\[k8s\.io\]\sVariable\sExpansion\sshould\sallow\ssubstituting\svalues\sin\sa\scontainer\'s\sargs\s\[NodeConformance\]\s\[Conformance\]\s\[Suite\:openshift\/conformance\/parallel\/minimal\]\s\[Suite\:k8s\]$'
fail [k8s.io/kubernetes/test/e2e/framework/util.go:2449]: Unexpected error:
    <*errors.errorString | 0xc003dce0e0>: {
        s: "failed to get logs from var-expansion-7d3ce198-cf04-11e9-a1db-0a58ac1050c1 for dapi-container: an error on the server (\"unknown\") has prevented the request from succeeding (get pods var-expansion-7d3ce198-cf04-11e9-a1db-0a58ac1050c1)",
    }
    failed to get logs from var-expansion-7d3ce198-cf04-11e9-a1db-0a58ac1050c1 for dapi-container: an error on the server ("unknown") has prevented the request from succeeding (get pods var-expansion-7d3ce198-cf04-11e9-a1db-0a58ac1050c1)
occurred
				
				Click to see stdout/stderrfrom junit_e2e_20190904-120149.xml

Filter through log files


openshift-tests [sig-cli] Kubectl Port forwarding [k8s.io] With a server listening on 0.0.0.0 [k8s.io] that expects a client request should support a client that connects, sends DATA, and disconnects [Suite:openshift/conformance/parallel] [Suite:k8s] 42s

go run hack/e2e.go -v -test --test_args='--ginkgo.focus=openshift\-tests\s\[sig\-cli\]\sKubectl\sPort\sforwarding\s\[k8s\.io\]\sWith\sa\sserver\slistening\son\s0\.0\.0\.0\s\[k8s\.io\]\sthat\sexpects\sa\sclient\srequest\sshould\ssupport\sa\sclient\sthat\sconnects\,\ssends\sDATA\,\sand\sdisconnects\s\[Suite\:openshift\/conformance\/parallel\]\s\[Suite\:k8s\]$'
fail [k8s.io/kubernetes/test/e2e/kubectl/portforward.go:328]: Sep  4 11:25:35.589: Expected "xxxxxxxxxxxxxxxxxxxxxxxxxxxxxxxxxxxxxxxxxxxxxxxxxxxxxxxxxxxxxxxxxxxxxxxxxxxxxxxxxxxxxxxxxxxxxxxxxxxx" from server, got "xxxxxxxxxx"
				
				Click to see stdout/stderrfrom junit_e2e_20190904-120149.xml

Filter through log files


openshift-tests [sig-cli] Kubectl Port forwarding [k8s.io] With a server listening on localhost [k8s.io] that expects a client request should support a client that connects, sends DATA, and disconnects [Suite:openshift/conformance/parallel] [Suite:k8s] 1m53s

go run hack/e2e.go -v -test --test_args='--ginkgo.focus=openshift\-tests\s\[sig\-cli\]\sKubectl\sPort\sforwarding\s\[k8s\.io\]\sWith\sa\sserver\slistening\son\slocalhost\s\[k8s\.io\]\sthat\sexpects\sa\sclient\srequest\sshould\ssupport\sa\sclient\sthat\sconnects\,\ssends\sDATA\,\sand\sdisconnects\s\[Suite\:openshift\/conformance\/parallel\]\s\[Suite\:k8s\]$'
fail [k8s.io/kubernetes/test/e2e/kubectl/portforward.go:183]: Sep  4 11:10:25.657: Failed to read from kubectl port-forward stdout: EOF
				
				Click to see stdout/stderrfrom junit_e2e_20190904-120149.xml

Filter through log files


openshift-tests [sig-node] Downward API should provide default limits.cpu/memory from node allocatable [NodeConformance] [Conformance] [Suite:openshift/conformance/parallel/minimal] [Suite:k8s] 45s

go run hack/e2e.go -v -test --test_args='--ginkgo.focus=openshift\-tests\s\[sig\-node\]\sDownward\sAPI\sshould\sprovide\sdefault\slimits\.cpu\/memory\sfrom\snode\sallocatable\s\[NodeConformance\]\s\[Conformance\]\s\[Suite\:openshift\/conformance\/parallel\/minimal\]\s\[Suite\:k8s\]$'
fail [k8s.io/kubernetes/test/e2e/framework/util.go:2449]: Unexpected error:
    <*errors.errorString | 0xc0034f47d0>: {
        s: "failed to get logs from downward-api-6a4cf81d-cf04-11e9-98a4-0a58ac1050c1 for dapi-container: an error on the server (\"unknown\") has prevented the request from succeeding (get pods downward-api-6a4cf81d-cf04-11e9-98a4-0a58ac1050c1)",
    }
    failed to get logs from downward-api-6a4cf81d-cf04-11e9-98a4-0a58ac1050c1 for dapi-container: an error on the server ("unknown") has prevented the request from succeeding (get pods downward-api-6a4cf81d-cf04-11e9-98a4-0a58ac1050c1)
occurred
				
				Click to see stdout/stderrfrom junit_e2e_20190904-120149.xml

Filter through log files


openshift-tests [sig-storage] In-tree Volumes [Driver: gluster] [Testpattern: Pre-provisioned PV (default fs)] subPath should support readOnly file specified in the volumeMount [Suite:openshift/conformance/parallel] [Suite:k8s] 2m27s

go run hack/e2e.go -v -test --test_args='--ginkgo.focus=openshift\-tests\s\[sig\-storage\]\sIn\-tree\sVolumes\s\[Driver\:\sgluster\]\s\[Testpattern\:\sPre\-provisioned\sPV\s\(default\sfs\)\]\ssubPath\sshould\ssupport\sreadOnly\sfile\sspecified\sin\sthe\svolumeMount\s\[Suite\:openshift\/conformance\/parallel\]\s\[Suite\:k8s\]$'
fail [k8s.io/kubernetes/test/e2e/framework/util.go:2449]: Unexpected error:
    <*errors.errorString | 0xc003800a60>: {
        s: "failed to get logs from pod-subpath-test-gluster-preprovisionedpv-bwss for test-container-subpath-gluster-preprovisionedpv-bwss: an error on the server (\"unknown\") has prevented the request from succeeding (get pods pod-subpath-test-gluster-preprovisionedpv-bwss)",
    }
    failed to get logs from pod-subpath-test-gluster-preprovisionedpv-bwss for test-container-subpath-gluster-preprovisionedpv-bwss: an error on the server ("unknown") has prevented the request from succeeding (get pods pod-subpath-test-gluster-preprovisionedpv-bwss)
occurred
				
				Click to see stdout/stderrfrom junit_e2e_20190904-120149.xml

Filter through log files


openshift-tests [sig-storage] In-tree Volumes [Driver: local][LocalVolumeType: blockfs] [Testpattern: Pre-provisioned PV (default fs)] subPath should support non-existent path [Suite:openshift/conformance/parallel] [Suite:k8s] 57s

go run hack/e2e.go -v -test --test_args='--ginkgo.focus=openshift\-tests\s\[sig\-storage\]\sIn\-tree\sVolumes\s\[Driver\:\slocal\]\[LocalVolumeType\:\sblockfs\]\s\[Testpattern\:\sPre\-provisioned\sPV\s\(default\sfs\)\]\ssubPath\sshould\ssupport\snon\-existent\spath\s\[Suite\:openshift\/conformance\/parallel\]\s\[Suite\:k8s\]$'
fail [k8s.io/kubernetes/test/e2e/storage/utils/local.go:134]: Unexpected error:
    <exec.CodeExitError>: {
        Err: {
            s: "error running &{/usr/bin/kubectl [kubectl --server=https://api.ci-op-f5v5njib-282fe.ci.azure.devcluster.openshift.com:6443 --kubeconfig=/tmp/admin.kubeconfig exec --namespace=e2e-provisioning-30 hostexec-ci-op-f5v5njib-282fe-m65cq-worker-centralus1-sxr2s -- nsenter --mount=/rootfs/proc/1/ns/mnt -- sh -c mkdir -p /tmp/local-driver-817094ec-cf04-11e9-bbc4-0a58ac1050c1 && dd if=/dev/zero of=/tmp/local-driver-817094ec-cf04-11e9-bbc4-0a58ac1050c1/file bs=4096 count=5120 && sudo losetup -f /tmp/local-driver-817094ec-cf04-11e9-bbc4-0a58ac1050c1/file] []  <nil>  Error from server: error dialing backend: remote error: tls: internal error\n [] <nil> 0xc002ed2810 exit status 1 <nil> <nil> true [0xc002d52eb0 0xc002d52ee0 0xc002d52f00] [0xc002d52eb0 0xc002d52ee0 0xc002d52f00] [0xc002d52ed0 0xc002d52ef8] [0x95a210 0x95a210] 0xc00237f4a0 <nil>}:\nCommand stdout:\n\nstderr:\nError from server: error dialing backend: remote error: tls: internal error\n\nerror:\nexit status 1\n",
        },
        Code: 1,
    }
    error running &{/usr/bin/kubectl [kubectl --server=https://api.ci-op-f5v5njib-282fe.ci.azure.devcluster.openshift.com:6443 --kubeconfig=/tmp/admin.kubeconfig exec --namespace=e2e-provisioning-30 hostexec-ci-op-f5v5njib-282fe-m65cq-worker-centralus1-sxr2s -- nsenter --mount=/rootfs/proc/1/ns/mnt -- sh -c mkdir -p /tmp/local-driver-817094ec-cf04-11e9-bbc4-0a58ac1050c1 && dd if=/dev/zero of=/tmp/local-driver-817094ec-cf04-11e9-bbc4-0a58ac1050c1/file bs=4096 count=5120 && sudo losetup -f /tmp/local-driver-817094ec-cf04-11e9-bbc4-0a58ac1050c1/file] []  <nil>  Error from server: error dialing backend: remote error: tls: internal error
     [] <nil> 0xc002ed2810 exit status 1 <nil> <nil> true [0xc002d52eb0 0xc002d52ee0 0xc002d52f00] [0xc002d52eb0 0xc002d52ee0 0xc002d52f00] [0xc002d52ed0 0xc002d52ef8] [0x95a210 0x95a210] 0xc00237f4a0 <nil>}:
    Command stdout:
    
    stderr:
    Error from server: error dialing backend: remote error: tls: internal error
    
    error:
    exit status 1
    
occurred
				
				Click to see stdout/stderrfrom junit_e2e_20190904-120149.xml

Filter through log files


openshift-tests [sig-storage] In-tree Volumes [Driver: local][LocalVolumeType: dir-bindmounted] [Testpattern: Pre-provisioned PV (block volmode)] volumeMode should fail to create pod by failing to mount volume [Suite:openshift/conformance/parallel] [Suite:k8s] 28s

go run hack/e2e.go -v -test --test_args='--ginkgo.focus=openshift\-tests\s\[sig\-storage\]\sIn\-tree\sVolumes\s\[Driver\:\slocal\]\[LocalVolumeType\:\sdir\-bindmounted\]\s\[Testpattern\:\sPre\-provisioned\sPV\s\(block\svolmode\)\]\svolumeMode\sshould\sfail\sto\screate\spod\sby\sfailing\sto\smount\svolume\s\[Suite\:openshift\/conformance\/parallel\]\s\[Suite\:k8s\]$'
fail [k8s.io/kubernetes/test/e2e/storage/utils/local.go:239]: Unexpected error:
    <exec.CodeExitError>: {
        Err: {
            s: "error running &{/usr/bin/kubectl [kubectl --server=https://api.ci-op-f5v5njib-282fe.ci.azure.devcluster.openshift.com:6443 --kubeconfig=/tmp/admin.kubeconfig exec --namespace=e2e-volumemode-1010 hostexec-ci-op-f5v5njib-282fe-m65cq-worker-centralus1-sxr2s -- nsenter --mount=/rootfs/proc/1/ns/mnt -- sh -c mkdir /tmp/local-driver-5ab10818-cf04-11e9-aa00-0a58ac1050c1 && sudo mount --bind /tmp/local-driver-5ab10818-cf04-11e9-aa00-0a58ac1050c1 /tmp/local-driver-5ab10818-cf04-11e9-aa00-0a58ac1050c1] []  <nil>  Error from server: error dialing backend: remote error: tls: internal error\n [] <nil> 0xc001519080 exit status 1 <nil> <nil> true [0xc00399e1f8 0xc00399e210 0xc00399e228] [0xc00399e1f8 0xc00399e210 0xc00399e228] [0xc00399e208 0xc00399e220] [0x95a210 0x95a210] 0xc002eec120 <nil>}:\nCommand stdout:\n\nstderr:\nError from server: error dialing backend: remote error: tls: internal error\n\nerror:\nexit status 1\n",
        },
        Code: 1,
    }
    error running &{/usr/bin/kubectl [kubectl --server=https://api.ci-op-f5v5njib-282fe.ci.azure.devcluster.openshift.com:6443 --kubeconfig=/tmp/admin.kubeconfig exec --namespace=e2e-volumemode-1010 hostexec-ci-op-f5v5njib-282fe-m65cq-worker-centralus1-sxr2s -- nsenter --mount=/rootfs/proc/1/ns/mnt -- sh -c mkdir /tmp/local-driver-5ab10818-cf04-11e9-aa00-0a58ac1050c1 && sudo mount --bind /tmp/local-driver-5ab10818-cf04-11e9-aa00-0a58ac1050c1 /tmp/local-driver-5ab10818-cf04-11e9-aa00-0a58ac1050c1] []  <nil>  Error from server: error dialing backend: remote error: tls: internal error
     [] <nil> 0xc001519080 exit status 1 <nil> <nil> true [0xc00399e1f8 0xc00399e210 0xc00399e228] [0xc00399e1f8 0xc00399e210 0xc00399e228] [0xc00399e208 0xc00399e220] [0x95a210 0x95a210] 0xc002eec120 <nil>}:
    Command stdout:
    
    stderr:
    Error from server: error dialing backend: remote error: tls: internal error
    
    error:
    exit status 1
    
occurred
				
				Click to see stdout/stderrfrom junit_e2e_20190904-120149.xml

Filter through log files


openshift-tests [sig-storage] PersistentVolumes-local [Volume type: block] One pod requesting one prebound PVC should be able to mount volume and write from pod1 [Suite:openshift/conformance/parallel] [Suite:k8s] 55s

go run hack/e2e.go -v -test --test_args='--ginkgo.focus=openshift\-tests\s\[sig\-storage\]\sPersistentVolumes\-local\s\s\[Volume\stype\:\sblock\]\sOne\spod\srequesting\sone\sprebound\sPVC\sshould\sbe\sable\sto\smount\svolume\sand\swrite\sfrom\spod1\s\[Suite\:openshift\/conformance\/parallel\]\s\[Suite\:k8s\]$'
fail [k8s.io/kubernetes/test/e2e/storage/utils/local.go:134]: Unexpected error:
    <exec.CodeExitError>: {
        Err: {
            s: "error running &{/usr/bin/kubectl [kubectl --server=https://api.ci-op-f5v5njib-282fe.ci.azure.devcluster.openshift.com:6443 --kubeconfig=/tmp/admin.kubeconfig exec --namespace=e2e-persistent-local-volumes-test-4463 hostexec-ci-op-f5v5njib-282fe-m65cq-worker-centralus1-sxr2s -- nsenter --mount=/rootfs/proc/1/ns/mnt -- sh -c mkdir -p /tmp/local-volume-test-82e887c0-cf04-11e9-bcd4-0a58ac1050c1 && dd if=/dev/zero of=/tmp/local-volume-test-82e887c0-cf04-11e9-bcd4-0a58ac1050c1/file bs=4096 count=5120 && sudo losetup -f /tmp/local-volume-test-82e887c0-cf04-11e9-bcd4-0a58ac1050c1/file] []  <nil>  Error from server: error dialing backend: remote error: tls: internal error\n [] <nil> 0xc003e40fc0 exit status 1 <nil> <nil> true [0xc002ccdc58 0xc002ccdc70 0xc002ccdca0] [0xc002ccdc58 0xc002ccdc70 0xc002ccdca0] [0xc002ccdc68 0xc002ccdc90] [0x95a210 0x95a210] 0xc002b630e0 <nil>}:\nCommand stdout:\n\nstderr:\nError from server: error dialing backend: remote error: tls: internal error\n\nerror:\nexit status 1\n",
        },
        Code: 1,
    }
    error running &{/usr/bin/kubectl [kubectl --server=https://api.ci-op-f5v5njib-282fe.ci.azure.devcluster.openshift.com:6443 --kubeconfig=/tmp/admin.kubeconfig exec --namespace=e2e-persistent-local-volumes-test-4463 hostexec-ci-op-f5v5njib-282fe-m65cq-worker-centralus1-sxr2s -- nsenter --mount=/rootfs/proc/1/ns/mnt -- sh -c mkdir -p /tmp/local-volume-test-82e887c0-cf04-11e9-bcd4-0a58ac1050c1 && dd if=/dev/zero of=/tmp/local-volume-test-82e887c0-cf04-11e9-bcd4-0a58ac1050c1/file bs=4096 count=5120 && sudo losetup -f /tmp/local-volume-test-82e887c0-cf04-11e9-bcd4-0a58ac1050c1/file] []  <nil>  Error from server: error dialing backend: remote error: tls: internal error
     [] <nil> 0xc003e40fc0 exit status 1 <nil> <nil> true [0xc002ccdc58 0xc002ccdc70 0xc002ccdca0] [0xc002ccdc58 0xc002ccdc70 0xc002ccdca0] [0xc002ccdc68 0xc002ccdc90] [0x95a210 0x95a210] 0xc002b630e0 <nil>}:
    Command stdout:
    
    stderr:
    Error from server: error dialing backend: remote error: tls: internal error
    
    error:
    exit status 1
    
occurred
				
				Click to see stdout/stderrfrom junit_e2e_20190904-120149.xml

Filter through log files


openshift-tests [sig-storage] PersistentVolumes-local [Volume type: blockfswithoutformat] Set fsGroup for local volume should set fsGroup for one pod [Suite:openshift/conformance/parallel] [Suite:k8s] 25s

go run hack/e2e.go -v -test --test_args='--ginkgo.focus=openshift\-tests\s\[sig\-storage\]\sPersistentVolumes\-local\s\s\[Volume\stype\:\sblockfswithoutformat\]\sSet\sfsGroup\sfor\slocal\svolume\sshould\sset\sfsGroup\sfor\sone\spod\s\[Suite\:openshift\/conformance\/parallel\]\s\[Suite\:k8s\]$'
fail [k8s.io/kubernetes/test/e2e/storage/utils/local.go:134]: Unexpected error:
    <exec.CodeExitError>: {
        Err: {
            s: "error running &{/usr/bin/kubectl [kubectl --server=https://api.ci-op-f5v5njib-282fe.ci.azure.devcluster.openshift.com:6443 --kubeconfig=/tmp/admin.kubeconfig exec --namespace=e2e-persistent-local-volumes-test-6397 hostexec-ci-op-f5v5njib-282fe-m65cq-worker-centralus1-sxr2s -- nsenter --mount=/rootfs/proc/1/ns/mnt -- sh -c mkdir -p /tmp/local-volume-test-700449a5-cf04-11e9-b960-0a58ac1050c1 && dd if=/dev/zero of=/tmp/local-volume-test-700449a5-cf04-11e9-b960-0a58ac1050c1/file bs=4096 count=5120 && sudo losetup -f /tmp/local-volume-test-700449a5-cf04-11e9-b960-0a58ac1050c1/file] []  <nil>  Error from server: error dialing backend: remote error: tls: internal error\n [] <nil> 0xc003e60f00 exit status 1 <nil> <nil> true [0xc003afaff0 0xc003afb008 0xc003afb020] [0xc003afaff0 0xc003afb008 0xc003afb020] [0xc003afb000 0xc003afb018] [0x95a210 0x95a210] 0xc002745da0 <nil>}:\nCommand stdout:\n\nstderr:\nError from server: error dialing backend: remote error: tls: internal error\n\nerror:\nexit status 1\n",
        },
        Code: 1,
    }
    error running &{/usr/bin/kubectl [kubectl --server=https://api.ci-op-f5v5njib-282fe.ci.azure.devcluster.openshift.com:6443 --kubeconfig=/tmp/admin.kubeconfig exec --namespace=e2e-persistent-local-volumes-test-6397 hostexec-ci-op-f5v5njib-282fe-m65cq-worker-centralus1-sxr2s -- nsenter --mount=/rootfs/proc/1/ns/mnt -- sh -c mkdir -p /tmp/local-volume-test-700449a5-cf04-11e9-b960-0a58ac1050c1 && dd if=/dev/zero of=/tmp/local-volume-test-700449a5-cf04-11e9-b960-0a58ac1050c1/file bs=4096 count=5120 && sudo losetup -f /tmp/local-volume-test-700449a5-cf04-11e9-b960-0a58ac1050c1/file] []  <nil>  Error from server: error dialing backend: remote error: tls: internal error
     [] <nil> 0xc003e60f00 exit status 1 <nil> <nil> true [0xc003afaff0 0xc003afb008 0xc003afb020] [0xc003afaff0 0xc003afb008 0xc003afb020] [0xc003afb000 0xc003afb018] [0x95a210 0x95a210] 0xc002745da0 <nil>}:
    Command stdout:
    
    stderr:
    Error from server: error dialing backend: remote error: tls: internal error
    
    error:
    exit status 1
    
occurred
				
				Click to see stdout/stderrfrom junit_e2e_20190904-120149.xml

Filter through log files


openshift-tests [sig-storage] PersistentVolumes-local [Volume type: dir-bindmounted] One pod requesting one prebound PVC should be able to mount volume and read from pod1 [Suite:openshift/conformance/parallel] [Suite:k8s] 28s

go run hack/e2e.go -v -test --test_args='--ginkgo.focus=openshift\-tests\s\[sig\-storage\]\sPersistentVolumes\-local\s\s\[Volume\stype\:\sdir\-bindmounted\]\sOne\spod\srequesting\sone\sprebound\sPVC\sshould\sbe\sable\sto\smount\svolume\sand\sread\sfrom\spod1\s\[Suite\:openshift\/conformance\/parallel\]\s\[Suite\:k8s\]$'
fail [k8s.io/kubernetes/test/e2e/storage/utils/local.go:239]: Unexpected error:
    <exec.CodeExitError>: {
        Err: {
            s: "error running &{/usr/bin/kubectl [kubectl --server=https://api.ci-op-f5v5njib-282fe.ci.azure.devcluster.openshift.com:6443 --kubeconfig=/tmp/admin.kubeconfig exec --namespace=e2e-persistent-local-volumes-test-9910 hostexec-ci-op-f5v5njib-282fe-m65cq-worker-centralus1-sxr2s -- nsenter --mount=/rootfs/proc/1/ns/mnt -- sh -c mkdir /tmp/local-volume-test-b1830941-cf04-11e9-a27f-0a58ac1050c1 && sudo mount --bind /tmp/local-volume-test-b1830941-cf04-11e9-a27f-0a58ac1050c1 /tmp/local-volume-test-b1830941-cf04-11e9-a27f-0a58ac1050c1] []  <nil>  Error from server: error dialing backend: remote error: tls: internal error\n [] <nil> 0xc001730090 exit status 1 <nil> <nil> true [0xc0038903b0 0xc0038903c8 0xc0038903e0] [0xc0038903b0 0xc0038903c8 0xc0038903e0] [0xc0038903c0 0xc0038903d8] [0x95a210 0x95a210] 0xc002d26ea0 <nil>}:\nCommand stdout:\n\nstderr:\nError from server: error dialing backend: remote error: tls: internal error\n\nerror:\nexit status 1\n",
        },
        Code: 1,
    }
    error running &{/usr/bin/kubectl [kubectl --server=https://api.ci-op-f5v5njib-282fe.ci.azure.devcluster.openshift.com:6443 --kubeconfig=/tmp/admin.kubeconfig exec --namespace=e2e-persistent-local-volumes-test-9910 hostexec-ci-op-f5v5njib-282fe-m65cq-worker-centralus1-sxr2s -- nsenter --mount=/rootfs/proc/1/ns/mnt -- sh -c mkdir /tmp/local-volume-test-b1830941-cf04-11e9-a27f-0a58ac1050c1 && sudo mount --bind /tmp/local-volume-test-b1830941-cf04-11e9-a27f-0a58ac1050c1 /tmp/local-volume-test-b1830941-cf04-11e9-a27f-0a58ac1050c1] []  <nil>  Error from server: error dialing backend: remote error: tls: internal error
     [] <nil> 0xc001730090 exit status 1 <nil> <nil> true [0xc0038903b0 0xc0038903c8 0xc0038903e0] [0xc0038903b0 0xc0038903c8 0xc0038903e0] [0xc0038903c0 0xc0038903d8] [0x95a210 0x95a210] 0xc002d26ea0 <nil>}:
    Command stdout:
    
    stderr:
    Error from server: error dialing backend: remote error: tls: internal error
    
    error:
    exit status 1
    
occurred
				
				Click to see stdout/stderrfrom junit_e2e_20190904-120149.xml

Filter through log files


openshift-tests [sig-storage] PersistentVolumes-local [Volume type: dir-link-bindmounted] Set fsGroup for local volume should set same fsGroup for two pods simultaneously [Suite:openshift/conformance/parallel] [Suite:k8s] 26s

go run hack/e2e.go -v -test --test_args='--ginkgo.focus=openshift\-tests\s\[sig\-storage\]\sPersistentVolumes\-local\s\s\[Volume\stype\:\sdir\-link\-bindmounted\]\sSet\sfsGroup\sfor\slocal\svolume\sshould\sset\ssame\sfsGroup\sfor\stwo\spods\ssimultaneously\s\[Suite\:openshift\/conformance\/parallel\]\s\[Suite\:k8s\]$'
fail [k8s.io/kubernetes/test/e2e/storage/utils/local.go:259]: Unexpected error:
    <exec.CodeExitError>: {
        Err: {
            s: "error running &{/usr/bin/kubectl [kubectl --server=https://api.ci-op-f5v5njib-282fe.ci.azure.devcluster.openshift.com:6443 --kubeconfig=/tmp/admin.kubeconfig exec --namespace=e2e-persistent-local-volumes-test-5220 hostexec-ci-op-f5v5njib-282fe-m65cq-worker-centralus1-sxr2s -- nsenter --mount=/rootfs/proc/1/ns/mnt -- sh -c mkdir /tmp/local-volume-test-70bd194b-cf04-11e9-a0c3-0a58ac1050c1-backend && sudo mount --bind /tmp/local-volume-test-70bd194b-cf04-11e9-a0c3-0a58ac1050c1-backend /tmp/local-volume-test-70bd194b-cf04-11e9-a0c3-0a58ac1050c1-backend && sudo ln -s /tmp/local-volume-test-70bd194b-cf04-11e9-a0c3-0a58ac1050c1-backend /tmp/local-volume-test-70bd194b-cf04-11e9-a0c3-0a58ac1050c1] []  <nil>  Error from server: error dialing backend: remote error: tls: internal error\n [] <nil> 0xc0038a2d80 exit status 1 <nil> <nil> true [0xc0008b5c98 0xc0008b5cb8 0xc0008b5ce0] [0xc0008b5c98 0xc0008b5cb8 0xc0008b5ce0] [0xc0008b5ca8 0xc0008b5cd8] [0x95a210 0x95a210] 0xc001cd4600 <nil>}:\nCommand stdout:\n\nstderr:\nError from server: error dialing backend: remote error: tls: internal error\n\nerror:\nexit status 1\n",
        },
        Code: 1,
    }
    error running &{/usr/bin/kubectl [kubectl --server=https://api.ci-op-f5v5njib-282fe.ci.azure.devcluster.openshift.com:6443 --kubeconfig=/tmp/admin.kubeconfig exec --namespace=e2e-persistent-local-volumes-test-5220 hostexec-ci-op-f5v5njib-282fe-m65cq-worker-centralus1-sxr2s -- nsenter --mount=/rootfs/proc/1/ns/mnt -- sh -c mkdir /tmp/local-volume-test-70bd194b-cf04-11e9-a0c3-0a58ac1050c1-backend && sudo mount --bind /tmp/local-volume-test-70bd194b-cf04-11e9-a0c3-0a58ac1050c1-backend /tmp/local-volume-test-70bd194b-cf04-11e9-a0c3-0a58ac1050c1-backend && sudo ln -s /tmp/local-volume-test-70bd194b-cf04-11e9-a0c3-0a58ac1050c1-backend /tmp/local-volume-test-70bd194b-cf04-11e9-a0c3-0a58ac1050c1] []  <nil>  Error from server: error dialing backend: remote error: tls: internal error
     [] <nil> 0xc0038a2d80 exit status 1 <nil> <nil> true [0xc0008b5c98 0xc0008b5cb8 0xc0008b5ce0] [0xc0008b5c98 0xc0008b5cb8 0xc0008b5ce0] [0xc0008b5ca8 0xc0008b5cd8] [0x95a210 0x95a210] 0xc001cd4600 <nil>}:
    Command stdout:
    
    stderr:
    Error from server: error dialing backend: remote error: tls: internal error
    
    error:
    exit status 1
    
occurred
				
				Click to see stdout/stderrfrom junit_e2e_20190904-120149.xml

Filter through log files


openshift-tests [sig-storage] Projected secret should be consumable from pods in volume as non-root with defaultMode and fsGroup set [LinuxOnly] [NodeConformance] [Conformance] [Suite:openshift/conformance/parallel/minimal] [Suite:k8s] 1m4s

go run hack/e2e.go -v -test --test_args='--ginkgo.focus=openshift\-tests\s\[sig\-storage\]\sProjected\ssecret\sshould\sbe\sconsumable\sfrom\spods\sin\svolume\sas\snon\-root\swith\sdefaultMode\sand\sfsGroup\sset\s\[LinuxOnly\]\s\[NodeConformance\]\s\[Conformance\]\s\[Suite\:openshift\/conformance\/parallel\/minimal\]\s\[Suite\:k8s\]$'
fail [k8s.io/kubernetes/test/e2e/framework/util.go:2449]: Unexpected error:
    <*errors.errorString | 0xc0034353d0>: {
        s: "failed to get logs from pod-projected-secrets-7f77b02c-cf04-11e9-887e-0a58ac1050c1 for projected-secret-volume-test: an error on the server (\"unknown\") has prevented the request from succeeding (get pods pod-projected-secrets-7f77b02c-cf04-11e9-887e-0a58ac1050c1)",
    }
    failed to get logs from pod-projected-secrets-7f77b02c-cf04-11e9-887e-0a58ac1050c1 for projected-secret-volume-test: an error on the server ("unknown") has prevented the request from succeeding (get pods pod-projected-secrets-7f77b02c-cf04-11e9-887e-0a58ac1050c1)
occurred
				
				Click to see stdout/stderrfrom junit_e2e_20190904-120149.xml

Filter through log files


Show 886 Passed Tests

Show 1287 Skipped Tests