ResultFAILURE
Tests 1 failed / 53 succeeded
Started2020-09-23 00:30
Elapsed3h39m
Work namespaceci-op-04h4ddw6
podf3e0facd-fd33-11ea-a149-0a580a820a4c
repos{u'opendatahub-io/odh-manifests': u'master'}
revision1

Test Failures


operator Run multi-stage test odh-manifests-e2e-nightly - odh-manifests-e2e-nightly-e2e container test 2h42m

go run hack/e2e.go -v -test --test_args='--ginkgo.focus=operator\sRun\smulti\-stage\stest\sodh\-manifests\-e2e\-nightly\s\-\sodh\-manifests\-e2e\-nightly\-e2e\scontainer\stest$'
n or 1200.000s: the command timed out


Standard output from the command:
Standard error from the command:


[ERROR] PID 32051: test/lib/log/stacktrace.sh:0: `return "${return_code}"` exited with status 1.

[INFO] 		Stack Trace: 
[INFO] 		  1: test/lib/log/stacktrace.sh:0: `return "${return_code}"`
[INFO] 		  2: test/lib/util/trap.sh:65: os::log::stacktrace::print
[INFO] 		  3: test/lib/cmd.sh:140: os::util::trap::err_handler
[INFO] 		  4: operator-tests/odh-manifests/basictests/superset.sh:15: os::cmd::try_until_text
[INFO] 		  5: operator-tests/odh-manifests/basictests/superset.sh:20: test_superset
[INFO]   Exiting with code 1.
failed: /root/peak/operator-tests/odh-manifests/basictests/superset.sh
/root/peak/operator-tests/odh-manifests/resources/kafka/image No [INFO] by in regex selected tests were
Already on project "opendatahub" on server "https://api.ci-op-04h4ddw6-fc36c.origin-ci-int-gce.dev.openshift.com:6443".
One or more tests failed:

	/root/peak/operator-tests/odh-manifests/basictests/ailibrary.sh
	/root/peak/operator-tests/odh-manifests/basictests/airflow.sh
	/root/peak/operator-tests/odh-manifests/basictests/grafana.sh
	/root/peak/operator-tests/odh-manifests/basictests/jupyterhub.sh
	/root/peak/operator-tests/odh-manifests/basictests/kafka.sh
	/root/peak/operator-tests/odh-manifests/basictests/odhargo.sh
	/root/peak/operator-tests/odh-manifests/basictests/prometheus.sh
	/root/peak/operator-tests/odh-manifests/basictests/radanalytics.sh
	/root/peak/operator-tests/odh-manifests/basictests/seldon.sh
	/root/peak/operator-tests/odh-manifests/basictests/superset.sh

/root/peak/run.sh took 9664 seconds
[INFO] Exiting with 1
+ '[' 1 -ne 0 ']'
+ echo 'The tests failed'
The tests failed
Here's a dump of the pods:
+ '[' -z '' ']'
+ echo 'Here'\''s a dump of the pods:'
+ oc get pods -o json -n opendatahub
{
    "apiVersion": "v1",
    "items": [],
    "kind": "List",
    "metadata": {
        "resourceVersion": "",
        "selfLink": ""
    }
}
+ exit 1
error: failed to execute wrapped command: exit status 1

				from junit_operator.xml

Filter through log files


Show 53 Passed Tests

Error lines from build-log.txt

... skipping 330 lines ...
[ERROR] PID 354: test/lib/log/stacktrace.sh:0: `return "${return_code}"` exited with status 1.
... skipping 36 lines ...
[ERROR] PID 5024: test/lib/log/stacktrace.sh:0: `return "${return_code}"` exited with status 1.
... skipping 36 lines ...
[ERROR] PID 9460: test/lib/log/stacktrace.sh:0: `return "${return_code}"` exited with status 1.
... skipping 41 lines ...
[ERROR] PID 13855: test/lib/log/stacktrace.sh:0: `return "${return_code}"` exited with status 1.
... skipping 33 lines ...
[ERROR] PID 18086: test/lib/log/stacktrace.sh:0: `return "${return_code}"` exited with status 1.
... skipping 36 lines ...
[ERROR] PID 22551: test/lib/log/stacktrace.sh:0: `return "${return_code}"` exited with status 1.
... skipping 31 lines ...
[ERROR] PID 27161: test/lib/log/stacktrace.sh:0: `return "${return_code}"` exited with status 1.
... skipping 40 lines ...
[ERROR] PID 31534: test/lib/log/stacktrace.sh:0: `return "${return_code}"` exited with status 1.
... skipping 34 lines ...
[ERROR] PID 31830: test/lib/log/stacktrace.sh:0: `return "${return_code}"` exited with status 1.
... skipping 36 lines ...
[ERROR] PID 32051: test/lib/log/stacktrace.sh:0: `return "${return_code}"` exited with status 1.
... skipping 79 lines ...
[ERROR] PID 32051: test/lib/log/stacktrace.sh:0: `return "${return_code}"` exited with status 1.
... skipping 49 lines ...