ResultFAILURE
Tests 1 failed / 7 succeeded
Started2020-06-02 18:01
Elapsed25m58s
Work namespaceci-op-1jypd6ds
podfcf0b314-a4fa-11ea-8ba4-0a580a8301c3
repos{u'redhat-developer/service-binding-operator': u'master'}
revision1

Test Failures


operator Run template validate-release - validate-release container setup 21s

go run hack/e2e.go -v -test --test_args='--ginkgo.focus=operator\sRun\stemplate\svalidate\-release\s\-\svalidate\-release\scontainer\ssetup$'
Installing from release registry.svc.ci.openshift.org/ci-op-1jypd6ds/release@sha256:b9efbbb3bc2a772f524ed13093d1fa3b1237f4c331aa8d55541115343f4a0c89
AWS region: us-west-2 (zones: us-west-2a us-west-2b)
level=info msg="Credentials loaded from the \"default\" profile in file \"/etc/openshift-installer/.awscred\""
level=info msg="Consuming Install Config from target directory"
level=warning msg="Found override for release image. Please be warned, this is not advised"
level=info msg="Consuming Openshift Manifests from target directory"
level=info msg="Consuming Worker Machines from target directory"
level=info msg="Consuming Master Machines from target directory"
level=info msg="Consuming Common Manifests from target directory"
level=info msg="Consuming OpenShift Install (Manifests) from target directory"
level=info msg="Credentials loaded from the \"default\" profile in file \"/etc/openshift-installer/.awscred\""
level=fatal msg="failed to fetch Cluster: failed to fetch dependency of \"Cluster\": failed to generate asset \"Platform Permissions Check\": validate AWS credentials: checking install permissions: error gathering AWS credentials details: error querying username: Throttling: Rate exceeded\n\tstatus code: 400, request id: 62bcbd54-21d4-4b57-a022-839cec5f5aed"

				from junit_operator.xml

Filter through log files


Show 7 Passed Tests

Error lines from build-log.txt

... skipping 61 lines ...