ResultFAILURE
Tests 261 failed / 722 succeeded
Started2019-11-07 16:32
Elapsed3h14m
Work namespaceci-op-35xzfv47
pod4.2.0-0.nightly-2019-11-07-162436-metal

Test Failures


openshift-tests Monitor cluster while tests execute 2h8m

go run hack/e2e.go -v -test --test_args='--ginkgo.focus=openshift\-tests\sMonitor\scluster\swhile\stests\sexecute$'
7 error level events were detected during this test run:

Nov 07 18:05:36.817 E ns/openshift-ingress pod/router-prometheus-5b7f967855-xrmmc node/worker-2.ci-op-35xzfv47-5e7ab.origin-ci-int-aws.dev.rhcloud.com container=router container exited with code 2 (Error): es\nE1107 18:03:09.418029       1 haproxy.go:392] can't scrape HAProxy: dial unix /var/lib/haproxy/run/haproxy.sock: connect: no such file or directory\nI1107 18:03:09.435832       1 router.go:561] Router reloaded:\n - Checking http://localhost:80 ...\n - Health check ok : 0 retry attempt(s).\nI1107 18:03:09.435848       1 router.go:255] Router is including routes in all namespaces\nI1107 18:03:09.856632       1 router.go:561] Router reloaded:\n - Checking http://localhost:80 ...\n - Health check ok : 0 retry attempt(s).\nI1107 18:03:14.856296       1 router.go:561] Router reloaded:\n - Checking http://localhost:80 ...\n - Health check ok : 0 retry attempt(s).\nI1107 18:03:22.687808       1 router.go:561] Router reloaded:\n - Checking http://localhost:80 ...\n - Health check ok : 0 retry attempt(s).\nI1107 18:03:27.687854       1 router.go:561] Router reloaded:\n - Checking http://localhost:80 ...\n - Health check ok : 0 retry attempt(s).\nI1107 18:03:34.704884       1 router.go:561] Router reloaded:\n - Checking http://localhost:80 ...\n - Health check ok : 0 retry attempt(s).\nI1107 18:03:39.704342       1 router.go:561] Router reloaded:\n - Checking http://localhost:80 ...\n - Health check ok : 0 retry attempt(s).\nI1107 18:04:03.431027       1 router.go:561] Router reloaded:\n - Checking http://localhost:80 ...\n - Health check ok : 0 retry attempt(s).\nI1107 18:04:08.428268       1 router.go:561] Router reloaded:\n - Checking http://localhost:80 ...\n - Health check ok : 0 retry attempt(s).\nI1107 18:04:16.445444       1 router.go:561] Router reloaded:\n - Checking http://localhost:80 ...\n - Health check ok : 0 retry attempt(s).\nI1107 18:04:23.230095       1 router.go:561] Router reloaded:\n - Checking http://localhost:80 ...\n - Health check ok : 0 retry attempt(s).\nI1107 18:04:59.734661       1 router.go:561] Router reloaded:\n - Checking http://localhost:80 ...\n - Health check ok : 0 retry attempt(s).\nI1107 18:05:34.577628       1 router.go:561] Router reloaded:\n - Checking http://localhost:80 ...\n - Health check ok : 0 retry attempt(s).\n
Nov 07 19:09:20.114 - 2220s E openshift-apiserver OpenShift API is not responding to GET requests
Nov 07 19:09:56.572 E kube-apiserver Kube API started failing: Get https://api.ci-op-35xzfv47-5e7ab.origin-ci-int-aws.dev.rhcloud.com:6443/api/v1/namespaces/kube-system?timeout=3s: unexpected EOF
Nov 07 19:10:05.114 - 2175s E kube-apiserver Kube API is not responding to GET requests
Nov 07 19:13:03.771 E kube-apiserver failed contacting the API: Get https://api.ci-op-35xzfv47-5e7ab.origin-ci-int-aws.dev.rhcloud.com:6443/api/v1/pods?resourceVersion=135296&timeout=5m42s&timeoutSeconds=342&watch=true: dial tcp 139.178.70.213:6443: connect: connection refused
Nov 07 19:13:03.771 E kube-apiserver failed contacting the API: Get https://api.ci-op-35xzfv47-5e7ab.origin-ci-int-aws.dev.rhcloud.com:6443/apis/config.openshift.io/v1/clusteroperators?resourceVersion=135293&timeout=6m40s&timeoutSeconds=400&watch=true: dial tcp 139.178.70.213:6443: connect: connection refused
Nov 07 19:13:03.771 E kube-apiserver failed contacting the API: Get https://api.ci-op-35xzfv47-5e7ab.origin-ci-int-aws.dev.rhcloud.com:6443/apis/config.openshift.io/v1/clusterversions?fieldSelector=metadata.name%3Dversion&resourceVersion=134911&timeout=8m45s&timeoutSeconds=525&watch=true: dial tcp 139.178.70.213:6443: connect: connection refused

				
				Click to see stdout/stderrfrom junit_e2e_20191107-194621.xml

Filter through log files


openshift-tests [Area:Networking] network isolation when using a plugin that isolates namespaces by default should prevent communication between pods in different namespaces on different nodes [Suite:openshift/conformance/parallel] 4m1s

go run hack/e2e.go -v -test --test_args='--ginkgo.focus=openshift\-tests\s\[Area\:Networking\]\snetwork\sisolation\swhen\susing\sa\splugin\sthat\sisolates\snamespaces\sby\sdefault\sshould\sprevent\scommunication\sbetween\spods\sin\sdifferent\snamespaces\son\sdifferent\snodes\s\[Suite\:openshift\/conformance\/parallel\]$'
fail [k8s.io/kubernetes/test/e2e/e2e.go:104]: Unexpected error:
    <*url.Error | 0xc003e9e000>: {
        Op: "Get",
        URL: "https://api.ci-op-35xzfv47-5e7ab.origin-ci-int-aws.dev.rhcloud.com:6443/api/v1/nodes?fieldSelector=spec.unschedulable%3Dfalse&resourceVersion=0",
        Err: {
            Op: "dial",
            Net: "tcp",
            Source: nil,
            Addr: {IP: "\x8b\xb2F\xd7", Port: 6443, Zone: ""},
            Err: {},
        },
    }
    Get https://api.ci-op-35xzfv47-5e7ab.origin-ci-int-aws.dev.rhcloud.com:6443/api/v1/nodes?fieldSelector=spec.unschedulable%3Dfalse&resourceVersion=0: dial tcp 139.178.70.215:6443: i/o timeout
occurred
				
				Click to see stdout/stderrfrom junit_e2e_20191107-194621.xml

Filter through log files


openshift-tests [Area:Networking] services when using a plugin that isolates namespaces by default should allow connections from pods in the default namespace to a service in another namespace on a different node [Suite:openshift/conformance/parallel] 3m2s

go run hack/e2e.go -v -test --test_args='--ginkgo.focus=openshift\-tests\s\[Area\:Networking\]\sservices\swhen\susing\sa\splugin\sthat\sisolates\snamespaces\sby\sdefault\sshould\sallow\sconnections\sfrom\spods\sin\sthe\sdefault\snamespace\sto\sa\sservice\sin\sanother\snamespace\son\sa\sdifferent\snode\s\[Suite\:openshift\/conformance\/parallel\]$'
fail [k8s.io/kubernetes/test/e2e/e2e.go:104]: Unexpected error:
    <*url.Error | 0xc003e50030>: {
        Op: "Get",
        URL: "https://api.ci-op-35xzfv47-5e7ab.origin-ci-int-aws.dev.rhcloud.com:6443/api/v1/nodes?fieldSelector=spec.unschedulable%3Dfalse&resourceVersion=0",
        Err: {
            Op: "dial",
            Net: "tcp",
            Source: nil,
            Addr: {IP: "\x93KI\xcf", Port: 6443, Zone: ""},
            Err: {},
        },
    }
    Get https://api.ci-op-35xzfv47-5e7ab.origin-ci-int-aws.dev.rhcloud.com:6443/api/v1/nodes?fieldSelector=spec.unschedulable%3Dfalse&resourceVersion=0: dial tcp 147.75.73.207:6443: i/o timeout
occurred
				
				Click to see stdout/stderrfrom junit_e2e_20191107-194621.xml

Filter through log files


openshift-tests [Conformance][Area:Networking][Feature:Router] The HAProxy router converges when multiple routers are writing conflicting status [Suite:openshift/conformance/parallel/minimal] 3m1s

go run hack/e2e.go -v -test --test_args='--ginkgo.focus=openshift\-tests\s\[Conformance\]\[Area\:Networking\]\[Feature\:Router\]\sThe\sHAProxy\srouter\sconverges\swhen\smultiple\srouters\sare\swriting\sconflicting\sstatus\s\[Suite\:openshift\/conformance\/parallel\/minimal\]$'
fail [github.com/openshift/origin/test/extended/router/stress.go:253]: Expected
    <int>: 43
to be <=
    <int>: 40
				
				Click to see stdout/stderrfrom junit_e2e_20191107-194621.xml

Filter through log files


openshift-tests [Conformance][Area:Networking][Feature:Router] The HAProxy router should expose the profiling endpoints [Suite:openshift/conformance/parallel/minimal] 3m1s

go run hack/e2e.go -v -test --test_args='--ginkgo.focus=openshift\-tests\s\[Conformance\]\[Area\:Networking\]\[Feature\:Router\]\sThe\sHAProxy\srouter\sshould\sexpose\sthe\sprofiling\sendpoints\s\[Suite\:openshift\/conformance\/parallel\/minimal\]$'
fail [k8s.io/kubernetes/test/e2e/e2e.go:104]: Unexpected error:
    <*url.Error | 0xc003e26360>: {
        Op: "Get",
        URL: "https://api.ci-op-35xzfv47-5e7ab.origin-ci-int-aws.dev.rhcloud.com:6443/api/v1/nodes?fieldSelector=spec.unschedulable%3Dfalse&resourceVersion=0",
        Err: {
            Op: "dial",
            Net: "tcp",
            Source: nil,
            Addr: {IP: "\x93KI\xcf", Port: 6443, Zone: ""},
            Err: {},
        },
    }
    Get https://api.ci-op-35xzfv47-5e7ab.origin-ci-int-aws.dev.rhcloud.com:6443/api/v1/nodes?fieldSelector=spec.unschedulable%3Dfalse&resourceVersion=0: dial tcp 147.75.73.207:6443: i/o timeout
occurred
				
				Click to see stdout/stderrfrom junit_e2e_20191107-194621.xml

Filter through log files


openshift-tests [Conformance][Area:Networking][Feature:Router] The HAProxy router should respond with 503 to unrecognized hosts [Suite:openshift/conformance/parallel/minimal] 4m3s

go run hack/e2e.go -v -test --test_args='--ginkgo.focus=openshift\-tests\s\[Conformance\]\[Area\:Networking\]\[Feature\:Router\]\sThe\sHAProxy\srouter\sshould\srespond\swith\s503\sto\sunrecognized\shosts\s\[Suite\:openshift\/conformance\/parallel\/minimal\]$'
fail [k8s.io/kubernetes/test/e2e/e2e.go:104]: Unexpected error:
    <*url.Error | 0xc003f70000>: {
        Op: "Get",
        URL: "https://api.ci-op-35xzfv47-5e7ab.origin-ci-int-aws.dev.rhcloud.com:6443/api/v1/nodes?fieldSelector=spec.unschedulable%3Dfalse&resourceVersion=0",
        Err: {
            Op: "dial",
            Net: "tcp",
            Source: nil,
            Addr: {IP: "\x93KI\xcf", Port: 6443, Zone: ""},
            Err: {},
        },
    }
    Get https://api.ci-op-35xzfv47-5e7ab.origin-ci-int-aws.dev.rhcloud.com:6443/api/v1/nodes?fieldSelector=spec.unschedulable%3Dfalse&resourceVersion=0: dial tcp 147.75.73.207:6443: i/o timeout
occurred
				
				Click to see stdout/stderrfrom junit_e2e_20191107-194621.xml

Filter through log files


openshift-tests [Conformance][templates] templateinstance impersonation tests should pass impersonation update tests [Suite:openshift/conformance/parallel/minimal] 4m1s

go run hack/e2e.go -v -test --test_args='--ginkgo.focus=openshift\-tests\s\[Conformance\]\[templates\]\stemplateinstance\simpersonation\stests\sshould\spass\simpersonation\supdate\stests\s\[Suite\:openshift\/conformance\/parallel\/minimal\]$'
fail [k8s.io/kubernetes/test/e2e/e2e.go:104]: Unexpected error:
    <*url.Error | 0xc003e3a120>: {
        Op: "Get",
        URL: "https://api.ci-op-35xzfv47-5e7ab.origin-ci-int-aws.dev.rhcloud.com:6443/api/v1/nodes?fieldSelector=spec.unschedulable%3Dfalse&resourceVersion=0",
        Err: {
            Op: "dial",
            Net: "tcp",
            Source: nil,
            Addr: {IP: "\x93KI\xcf", Port: 6443, Zone: ""},
            Err: {},
        },
    }
    Get https://api.ci-op-35xzfv47-5e7ab.origin-ci-int-aws.dev.rhcloud.com:6443/api/v1/nodes?fieldSelector=spec.unschedulable%3Dfalse&resourceVersion=0: dial tcp 147.75.73.207:6443: i/o timeout
occurred
				
				Click to see stdout/stderrfrom junit_e2e_20191107-194621.xml

Filter through log files


openshift-tests [Conformance][templates] templateinstance object kinds test should create and delete objects from varying API groups [Suite:openshift/conformance/parallel/minimal] 4m1s

go run hack/e2e.go -v -test --test_args='--ginkgo.focus=openshift\-tests\s\[Conformance\]\[templates\]\stemplateinstance\sobject\skinds\stest\sshould\screate\sand\sdelete\sobjects\sfrom\svarying\sAPI\sgroups\s\[Suite\:openshift\/conformance\/parallel\/minimal\]$'
fail [k8s.io/kubernetes/test/e2e/e2e.go:104]: Unexpected error:
    <*url.Error | 0xc0030e6000>: {
        Op: "Get",
        URL: "https://api.ci-op-35xzfv47-5e7ab.origin-ci-int-aws.dev.rhcloud.com:6443/api/v1/nodes?fieldSelector=spec.unschedulable%3Dfalse&resourceVersion=0",
        Err: {
            Op: "dial",
            Net: "tcp",
            Source: nil,
            Addr: {IP: "\x8b\xb2F\xd7", Port: 6443, Zone: ""},
            Err: {},
        },
    }
    Get https://api.ci-op-35xzfv47-5e7ab.origin-ci-int-aws.dev.rhcloud.com:6443/api/v1/nodes?fieldSelector=spec.unschedulable%3Dfalse&resourceVersion=0: dial tcp 139.178.70.215:6443: i/o timeout
occurred
				
				Click to see stdout/stderrfrom junit_e2e_20191107-194621.xml

Filter through log files


openshift-tests [Conformance][templates] templateservicebroker security test should pass security tests [Suite:openshift/conformance/parallel/minimal] 3m2s

go run hack/e2e.go -v -test --test_args='--ginkgo.focus=openshift\-tests\s\[Conformance\]\[templates\]\stemplateservicebroker\ssecurity\stest\s\sshould\spass\ssecurity\stests\s\[Suite\:openshift\/conformance\/parallel\/minimal\]$'
fail [k8s.io/kubernetes/test/e2e/e2e.go:104]: Unexpected error:
    <*url.Error | 0xc003e1bad0>: {
        Op: "Get",
        URL: "https://api.ci-op-35xzfv47-5e7ab.origin-ci-int-aws.dev.rhcloud.com:6443/api/v1/nodes?fieldSelector=spec.unschedulable%3Dfalse&resourceVersion=0",
        Err: {
            Op: "dial",
            Net: "tcp",
            Source: nil,
            Addr: {IP: "\x8b\xb2F\xd5", Port: 6443, Zone: ""},
            Err: {},
        },
    }
    Get https://api.ci-op-35xzfv47-5e7ab.origin-ci-int-aws.dev.rhcloud.com:6443/api/v1/nodes?fieldSelector=spec.unschedulable%3Dfalse&resourceVersion=0: dial tcp 139.178.70.213:6443: i/o timeout
occurred
				
				Click to see stdout/stderrfrom junit_e2e_20191107-194621.xml

Filter through log files


openshift-tests [Feature:Builds] build with empty source started build should build even with an empty source in build config [Suite:openshift/conformance/parallel] 12m29s

go run hack/e2e.go -v -test --test_args='--ginkgo.focus=openshift\-tests\s\[Feature\:Builds\]\sbuild\swith\sempty\ssource\s\sstarted\sbuild\sshould\sbuild\seven\swith\san\sempty\ssource\sin\sbuild\sconfig\s\[Suite\:openshift\/conformance\/parallel\]$'
fail [k8s.io/kubernetes/test/e2e/framework/framework.go:338]: Nov  7 19:19:29.459: Couldn't delete ns: "e2e-test-cli-build-nosrc-2fhvk": Get https://api.ci-op-35xzfv47-5e7ab.origin-ci-int-aws.dev.rhcloud.com:6443/api?timeout=32s: dial tcp 139.178.70.213:6443: i/o timeout (&url.Error{Op:"Get", URL:"https://api.ci-op-35xzfv47-5e7ab.origin-ci-int-aws.dev.rhcloud.com:6443/api?timeout=32s", Err:(*net.OpError)(0xc002fcc730)})
				
				Click to see stdout/stderrfrom junit_e2e_20191107-194621.xml

Filter through log files


openshift-tests [Feature:Builds] result image should have proper labels set Docker build from a template should create a image from "test-docker-build.json" template with proper Docker labels [Suite:openshift/conformance/parallel] 3m2s

go run hack/e2e.go -v -test --test_args='--ginkgo.focus=openshift\-tests\s\[Feature\:Builds\]\sresult\simage\sshould\shave\sproper\slabels\sset\s\sDocker\sbuild\sfrom\sa\stemplate\sshould\screate\sa\simage\sfrom\s\"test\-docker\-build\.json\"\stemplate\swith\sproper\sDocker\slabels\s\[Suite\:openshift\/conformance\/parallel\]$'
fail [k8s.io/kubernetes/test/e2e/e2e.go:104]: Unexpected error:
    <*url.Error | 0xc003e5c000>: {
        Op: "Get",
        URL: "https://api.ci-op-35xzfv47-5e7ab.origin-ci-int-aws.dev.rhcloud.com:6443/api/v1/nodes?fieldSelector=spec.unschedulable%3Dfalse&resourceVersion=0",
        Err: {
            Op: "dial",
            Net: "tcp",
            Source: nil,
            Addr: {IP: "\x8b\xb2F\xd7", Port: 6443, Zone: ""},
            Err: {},
        },
    }
    Get https://api.ci-op-35xzfv47-5e7ab.origin-ci-int-aws.dev.rhcloud.com:6443/api/v1/nodes?fieldSelector=spec.unschedulable%3Dfalse&resourceVersion=0: dial tcp 139.178.70.215:6443: i/o timeout
occurred
				
				Click to see stdout/stderrfrom junit_e2e_20191107-194621.xml

Filter through log files


openshift-tests [Feature:Builds][Conformance] build without output image building from templates should create an image from a S2i template without an output image reference defined [Suite:openshift/conformance/parallel/minimal] 2m23s

go run hack/e2e.go -v -test --test_args='--ginkgo.focus=openshift\-tests\s\[Feature\:Builds\]\[Conformance\]\sbuild\swithout\soutput\simage\s\sbuilding\sfrom\stemplates\sshould\screate\san\simage\sfrom\sa\sS2i\stemplate\swithout\san\soutput\simage\sreference\sdefined\s\[Suite\:openshift\/conformance\/parallel\/minimal\]$'
fail [k8s.io/kubernetes/test/e2e/e2e.go:104]: Unexpected error:
    <*url.Error | 0xc002dae000>: {
        Op: "Get",
        URL: "https://api.ci-op-35xzfv47-5e7ab.origin-ci-int-aws.dev.rhcloud.com:6443/api/v1/nodes?fieldSelector=spec.unschedulable%3Dfalse&resourceVersion=0",
        Err: {
            Op: "dial",
            Net: "tcp",
            Source: nil,
            Addr: {IP: "\x93KI\xcf", Port: 6443, Zone: ""},
            Err: {},
        },
    }
    Get https://api.ci-op-35xzfv47-5e7ab.origin-ci-int-aws.dev.rhcloud.com:6443/api/v1/nodes?fieldSelector=spec.unschedulable%3Dfalse&resourceVersion=0: dial tcp 147.75.73.207:6443: i/o timeout
occurred
				
				Click to see stdout/stderrfrom junit_e2e_20191107-194621.xml

Filter through log files


openshift-tests [Feature:Builds][Conformance] build without output image building from templates should create an image from a docker template without an output image reference defined [Suite:openshift/conformance/parallel/minimal] 24s

go run hack/e2e.go -v -test --test_args='--ginkgo.focus=openshift\-tests\s\[Feature\:Builds\]\[Conformance\]\sbuild\swithout\soutput\simage\s\sbuilding\sfrom\stemplates\sshould\screate\san\simage\sfrom\sa\sdocker\stemplate\swithout\san\soutput\simage\sreference\sdefined\s\[Suite\:openshift\/conformance\/parallel\/minimal\]$'
fail [k8s.io/kubernetes/test/e2e/e2e.go:104]: Unexpected error:
    <*url.Error | 0xc0032dc150>: {
        Op: "Get",
        URL: "https://api.ci-op-35xzfv47-5e7ab.origin-ci-int-aws.dev.rhcloud.com:6443/api/v1/nodes?fieldSelector=spec.unschedulable%3Dfalse&resourceVersion=0",
        Err: {s: "unexpected EOF"},
    }
    Get https://api.ci-op-35xzfv47-5e7ab.origin-ci-int-aws.dev.rhcloud.com:6443/api/v1/nodes?fieldSelector=spec.unschedulable%3Dfalse&resourceVersion=0: unexpected EOF
occurred
				
				Click to see stdout/stderrfrom junit_e2e_20191107-194621.xml

Filter through log files


openshift-tests [Feature:Builds][Conformance] s2i build with a root user image should create a root build and fail without a privileged SCC [Suite:openshift/conformance/parallel/minimal] 3m3s

go run hack/e2e.go -v -test --test_args='--ginkgo.focus=openshift\-tests\s\[Feature\:Builds\]\[Conformance\]\ss2i\sbuild\swith\sa\sroot\suser\simage\sshould\screate\sa\sroot\sbuild\sand\sfail\swithout\sa\sprivileged\sSCC\s\[Suite\:openshift\/conformance\/parallel\/minimal\]$'
fail [k8s.io/kubernetes/test/e2e/e2e.go:104]: Unexpected error:
    <*url.Error | 0xc003eac000>: {
        Op: "Get",
        URL: "https://api.ci-op-35xzfv47-5e7ab.origin-ci-int-aws.dev.rhcloud.com:6443/api/v1/nodes?fieldSelector=spec.unschedulable%3Dfalse&resourceVersion=0",
        Err: {
            Op: "dial",
            Net: "tcp",
            Source: nil,
            Addr: {IP: "\x8b\xb2F\xd5", Port: 6443, Zone: ""},
            Err: {},
        },
    }
    Get https://api.ci-op-35xzfv47-5e7ab.origin-ci-int-aws.dev.rhcloud.com:6443/api/v1/nodes?fieldSelector=spec.unschedulable%3Dfalse&resourceVersion=0: dial tcp 139.178.70.213:6443: i/o timeout
occurred
				
				Click to see stdout/stderrfrom junit_e2e_20191107-194621.xml

Filter through log files


openshift-tests [Feature:Builds][Conformance] s2i build with a root user image should create a root build and pass with a privileged SCC [Suite:openshift/conformance/parallel/minimal] 3m17s

go run hack/e2e.go -v -test --test_args='--ginkgo.focus=openshift\-tests\s\[Feature\:Builds\]\[Conformance\]\ss2i\sbuild\swith\sa\sroot\suser\simage\sshould\screate\sa\sroot\sbuild\sand\spass\swith\sa\sprivileged\sSCC\s\[Suite\:openshift\/conformance\/parallel\/minimal\]$'
fail [k8s.io/kubernetes/test/e2e/e2e.go:104]: Unexpected error:
    <*url.Error | 0xc0037403f0>: {
        Op: "Get",
        URL: "https://api.ci-op-35xzfv47-5e7ab.origin-ci-int-aws.dev.rhcloud.com:6443/api/v1/nodes?fieldSelector=spec.unschedulable%3Dfalse&resourceVersion=0",
        Err: {s: "unexpected EOF"},
    }
    Get https://api.ci-op-35xzfv47-5e7ab.origin-ci-int-aws.dev.rhcloud.com:6443/api/v1/nodes?fieldSelector=spec.unschedulable%3Dfalse&resourceVersion=0: unexpected EOF
occurred
				
				Click to see stdout/stderrfrom junit_e2e_20191107-194621.xml

Filter through log files


openshift-tests [Feature:Builds][Conformance][valueFrom] process valueFrom in build strategy environment variables should successfully resolve valueFrom in s2i build environment variables [Suite:openshift/conformance/parallel/minimal] 4m2s

go run hack/e2e.go -v -test --test_args='--ginkgo.focus=openshift\-tests\s\[Feature\:Builds\]\[Conformance\]\[valueFrom\]\sprocess\svalueFrom\sin\sbuild\sstrategy\senvironment\svariables\s\sshould\ssuccessfully\sresolve\svalueFrom\sin\ss2i\sbuild\senvironment\svariables\s\[Suite\:openshift\/conformance\/parallel\/minimal\]$'
fail [k8s.io/kubernetes/test/e2e/e2e.go:104]: Unexpected error:
    <*url.Error | 0xc003f06000>: {
        Op: "Get",
        URL: "https://api.ci-op-35xzfv47-5e7ab.origin-ci-int-aws.dev.rhcloud.com:6443/api/v1/nodes?fieldSelector=spec.unschedulable%3Dfalse&resourceVersion=0",
        Err: {
            Op: "dial",
            Net: "tcp",
            Source: nil,
            Addr: {IP: "\x8b\xb2F\xd7", Port: 6443, Zone: ""},
            Err: {},
        },
    }
    Get https://api.ci-op-35xzfv47-5e7ab.origin-ci-int-aws.dev.rhcloud.com:6443/api/v1/nodes?fieldSelector=spec.unschedulable%3Dfalse&resourceVersion=0: dial tcp 139.178.70.215:6443: i/o timeout
occurred
				
				Click to see stdout/stderrfrom junit_e2e_20191107-194621.xml

Filter through log files


openshift-tests [Feature:Builds][pruning] prune builds based on settings in the buildconfig should prune failed builds based on the failedBuildsHistoryLimit setting [Suite:openshift/conformance/parallel] 4m4s

go run hack/e2e.go -v -test --test_args='--ginkgo.focus=openshift\-tests\s\[Feature\:Builds\]\[pruning\]\sprune\sbuilds\sbased\son\ssettings\sin\sthe\sbuildconfig\s\sshould\sprune\sfailed\sbuilds\sbased\son\sthe\sfailedBuildsHistoryLimit\ssetting\s\[Suite\:openshift\/conformance\/parallel\]$'
fail [k8s.io/kubernetes/test/e2e/e2e.go:104]: Unexpected error:
    <*url.Error | 0xc003f9a000>: {
        Op: "Get",
        URL: "https://api.ci-op-35xzfv47-5e7ab.origin-ci-int-aws.dev.rhcloud.com:6443/api/v1/nodes?fieldSelector=spec.unschedulable%3Dfalse&resourceVersion=0",
        Err: {
            Op: "dial",
            Net: "tcp",
            Source: nil,
            Addr: {IP: "\x8b\xb2F\xd7", Port: 6443, Zone: ""},
            Err: {},
        },
    }
    Get https://api.ci-op-35xzfv47-5e7ab.origin-ci-int-aws.dev.rhcloud.com:6443/api/v1/nodes?fieldSelector=spec.unschedulable%3Dfalse&resourceVersion=0: dial tcp 139.178.70.215:6443: i/o timeout
occurred
				
				Click to see stdout/stderrfrom junit_e2e_20191107-194621.xml

Filter through log files


openshift-tests [Feature:Builds][timing] capture build stages and durations should record build stages and durations for docker [Suite:openshift/conformance/parallel] 4m1s

go run hack/e2e.go -v -test --test_args='--ginkgo.focus=openshift\-tests\s\[Feature\:Builds\]\[timing\]\scapture\sbuild\sstages\sand\sdurations\s\sshould\srecord\sbuild\sstages\sand\sdurations\sfor\sdocker\s\[Suite\:openshift\/conformance\/parallel\]$'
fail [k8s.io/kubernetes/test/e2e/e2e.go:104]: Unexpected error:
    <*url.Error | 0xc00357a000>: {
        Op: "Get",
        URL: "https://api.ci-op-35xzfv47-5e7ab.origin-ci-int-aws.dev.rhcloud.com:6443/api/v1/nodes?fieldSelector=spec.unschedulable%3Dfalse&resourceVersion=0",
        Err: {
            Op: "dial",
            Net: "tcp",
            Source: nil,
            Addr: {IP: "\x8b\xb2F\xd7", Port: 6443, Zone: ""},
            Err: {},
        },
    }
    Get https://api.ci-op-35xzfv47-5e7ab.origin-ci-int-aws.dev.rhcloud.com:6443/api/v1/nodes?fieldSelector=spec.unschedulable%3Dfalse&resourceVersion=0: dial tcp 139.178.70.215:6443: i/o timeout
occurred
				
				Click to see stdout/stderrfrom junit_e2e_20191107-194621.xml

Filter through log files


openshift-tests [Feature:DeploymentConfig] deploymentconfigs generation [Conformance] should deploy based on a status version bump [Suite:openshift/conformance/parallel/minimal] 3m3s

go run hack/e2e.go -v -test --test_args='--ginkgo.focus=openshift\-tests\s\[Feature\:DeploymentConfig\]\sdeploymentconfigs\sgeneration\s\[Conformance\]\sshould\sdeploy\sbased\son\sa\sstatus\sversion\sbump\s\[Suite\:openshift\/conformance\/parallel\/minimal\]$'
fail [k8s.io/kubernetes/test/e2e/e2e.go:104]: Unexpected error:
    <*url.Error | 0xc003e57da0>: {
        Op: "Get",
        URL: "https://api.ci-op-35xzfv47-5e7ab.origin-ci-int-aws.dev.rhcloud.com:6443/api/v1/nodes?fieldSelector=spec.unschedulable%3Dfalse&resourceVersion=0",
        Err: {
            Op: "dial",
            Net: "tcp",
            Source: nil,
            Addr: {IP: "\x8b\xb2F\xd7", Port: 6443, Zone: ""},
            Err: {},
        },
    }
    Get https://api.ci-op-35xzfv47-5e7ab.origin-ci-int-aws.dev.rhcloud.com:6443/api/v1/nodes?fieldSelector=spec.unschedulable%3Dfalse&resourceVersion=0: dial tcp 139.178.70.215:6443: i/o timeout
occurred
				
				Click to see stdout/stderrfrom junit_e2e_20191107-194621.xml

Filter through log files


openshift-tests [Feature:DeploymentConfig] deploymentconfigs should respect image stream tag reference policy [Conformance] resolve the image pull spec [Suite:openshift/conformance/parallel/minimal] 3m24s

go run hack/e2e.go -v -test --test_args='--ginkgo.focus=openshift\-tests\s\[Feature\:DeploymentConfig\]\sdeploymentconfigs\sshould\srespect\simage\sstream\stag\sreference\spolicy\s\[Conformance\]\sresolve\sthe\simage\spull\sspec\s\[Suite\:openshift\/conformance\/parallel\/minimal\]$'
fail [k8s.io/kubernetes/test/e2e/framework/util.go:2685]: Non-retryable failure or timed out while listing nodes for e2e cluster.
Unexpected error:
    <*url.Error | 0xc003dc48d0>: {
        Op: "Get",
        URL: "https://api.ci-op-35xzfv47-5e7ab.origin-ci-int-aws.dev.rhcloud.com:6443/api/v1/nodes?fieldSelector=spec.unschedulable%3Dfalse",
        Err: {s: "unexpected EOF"},
    }
    Get https://api.ci-op-35xzfv47-5e7ab.origin-ci-int-aws.dev.rhcloud.com:6443/api/v1/nodes?fieldSelector=spec.unschedulable%3Dfalse: unexpected EOF
occurred
				
				Click to see stdout/stderrfrom junit_e2e_20191107-194621.xml

Filter through log files


openshift-tests [Feature:ImageLookup][registry][Conformance] Image policy should perform lookup when the pod has the resolve-names annotation [Suite:openshift/conformance/parallel/minimal] 4m4s

go run hack/e2e.go -v -test --test_args='--ginkgo.focus=openshift\-tests\s\[Feature\:ImageLookup\]\[registry\]\[Conformance\]\sImage\spolicy\sshould\sperform\slookup\swhen\sthe\spod\shas\sthe\sresolve\-names\sannotation\s\[Suite\:openshift\/conformance\/parallel\/minimal\]$'
fail [k8s.io/kubernetes/test/e2e/e2e.go:104]: Unexpected error:
    <*url.Error | 0xc003f66000>: {
        Op: "Get",
        URL: "https://api.ci-op-35xzfv47-5e7ab.origin-ci-int-aws.dev.rhcloud.com:6443/api/v1/nodes?fieldSelector=spec.unschedulable%3Dfalse&resourceVersion=0",
        Err: {
            Op: "dial",
            Net: "tcp",
            Source: nil,
            Addr: {IP: "\x93KI\xcf", Port: 6443, Zone: ""},
            Err: {},
        },
    }
    Get https://api.ci-op-35xzfv47-5e7ab.origin-ci-int-aws.dev.rhcloud.com:6443/api/v1/nodes?fieldSelector=spec.unschedulable%3Dfalse&resourceVersion=0: dial tcp 147.75.73.207:6443: i/o timeout
occurred
				
				Click to see stdout/stderrfrom junit_e2e_20191107-194621.xml

Filter through log files


openshift-tests [Feature:OAuthServer] [Token Expiration] Using a OAuth client with a non-default token max age to generate tokens that do not expire works as expected when using a token authorization flow [Suite:openshift/conformance/parallel] 4m2s

go run hack/e2e.go -v -test --test_args='--ginkgo.focus=openshift\-tests\s\[Feature\:OAuthServer\]\s\[Token\sExpiration\]\sUsing\sa\sOAuth\sclient\swith\sa\snon\-default\stoken\smax\sage\sto\sgenerate\stokens\sthat\sdo\snot\sexpire\sworks\sas\sexpected\swhen\susing\sa\stoken\sauthorization\sflow\s\[Suite\:openshift\/conformance\/parallel\]$'
fail [k8s.io/kubernetes/test/e2e/e2e.go:104]: Unexpected error:
    <*url.Error | 0xc002af6090>: {
        Op: "Get",
        URL: "https://api.ci-op-35xzfv47-5e7ab.origin-ci-int-aws.dev.rhcloud.com:6443/api/v1/nodes?fieldSelector=spec.unschedulable%3Dfalse&resourceVersion=0",
        Err: {
            Op: "dial",
            Net: "tcp",
            Source: nil,
            Addr: {IP: "\x93KI\xcf", Port: 6443, Zone: ""},
            Err: {},
        },
    }
    Get https://api.ci-op-35xzfv47-5e7ab.origin-ci-int-aws.dev.rhcloud.com:6443/api/v1/nodes?fieldSelector=spec.unschedulable%3Dfalse&resourceVersion=0: dial tcp 147.75.73.207:6443: i/o timeout
occurred
				
				Click to see stdout/stderrfrom junit_e2e_20191107-194621.xml

Filter through log files


openshift-tests [Feature:OpenShiftAuthorization] authorization TestAuthorizationSubjectAccessReviewAPIGroup should succeed [Suite:openshift/conformance/parallel] 4m2s

go run hack/e2e.go -v -test --test_args='--ginkgo.focus=openshift\-tests\s\[Feature\:OpenShiftAuthorization\]\sauthorization\s\sTestAuthorizationSubjectAccessReviewAPIGroup\sshould\ssucceed\s\[Suite\:openshift\/conformance\/parallel\]$'
fail [k8s.io/kubernetes/test/e2e/e2e.go:104]: Unexpected error:
    <*url.Error | 0xc003660000>: {
        Op: "Get",
        URL: "https://api.ci-op-35xzfv47-5e7ab.origin-ci-int-aws.dev.rhcloud.com:6443/api/v1/nodes?fieldSelector=spec.unschedulable%3Dfalse&resourceVersion=0",
        Err: {
            Op: "dial",
            Net: "tcp",
            Source: nil,
            Addr: {IP: "\x8b\xb2F\xd7", Port: 6443, Zone: ""},
            Err: {},
        },
    }
    Get https://api.ci-op-35xzfv47-5e7ab.origin-ci-int-aws.dev.rhcloud.com:6443/api/v1/nodes?fieldSelector=spec.unschedulable%3Dfalse&resourceVersion=0: dial tcp 139.178.70.215:6443: i/o timeout
occurred
				
				Click to see stdout/stderrfrom junit_e2e_20191107-194621.xml

Filter through log files


openshift-tests [Feature:OpenShiftAuthorization] authorization TestBrowserSafeAuthorizer should succeed [Suite:openshift/conformance/parallel] 4m1s

go run hack/e2e.go -v -test --test_args='--ginkgo.focus=openshift\-tests\s\[Feature\:OpenShiftAuthorization\]\sauthorization\s\sTestBrowserSafeAuthorizer\sshould\ssucceed\s\[Suite\:openshift\/conformance\/parallel\]$'
fail [k8s.io/kubernetes/test/e2e/e2e.go:104]: Unexpected error:
    <*url.Error | 0xc001964570>: {
        Op: "Get",
        URL: "https://api.ci-op-35xzfv47-5e7ab.origin-ci-int-aws.dev.rhcloud.com:6443/api/v1/nodes?fieldSelector=spec.unschedulable%3Dfalse&resourceVersion=0",
        Err: {
            Op: "dial",
            Net: "tcp",
            Source: nil,
            Addr: {IP: "\x8b\xb2F\xd7", Port: 6443, Zone: ""},
            Err: {},
        },
    }
    Get https://api.ci-op-35xzfv47-5e7ab.origin-ci-int-aws.dev.rhcloud.com:6443/api/v1/nodes?fieldSelector=spec.unschedulable%3Dfalse&resourceVersion=0: dial tcp 139.178.70.215:6443: i/o timeout
occurred
				
				Click to see stdout/stderrfrom junit_e2e_20191107-194621.xml

Filter through log files


openshift-tests [Feature:OpenShiftAuthorization] scopes TestTokensWithIllegalScopes should succeed [Suite:openshift/conformance/parallel] 4m8s

go run hack/e2e.go -v -test --test_args='--ginkgo.focus=openshift\-tests\s\[Feature\:OpenShiftAuthorization\]\sscopes\sTestTokensWithIllegalScopes\sshould\ssucceed\s\[Suite\:openshift\/conformance\/parallel\]$'
fail [k8s.io/kubernetes/test/e2e/e2e.go:104]: Unexpected error:
    <*url.Error | 0xc003eff980>: {
        Op: "Get",
        URL: "https://api.ci-op-35xzfv47-5e7ab.origin-ci-int-aws.dev.rhcloud.com:6443/api/v1/nodes?fieldSelector=spec.unschedulable%3Dfalse&resourceVersion=0",
        Err: {
            Op: "dial",
            Net: "tcp",
            Source: nil,
            Addr: {IP: "\x8b\xb2F\xd5", Port: 6443, Zone: ""},
            Err: {},
        },
    }
    Get https://api.ci-op-35xzfv47-5e7ab.origin-ci-int-aws.dev.rhcloud.com:6443/api/v1/nodes?fieldSelector=spec.unschedulable%3Dfalse&resourceVersion=0: dial tcp 139.178.70.213:6443: i/o timeout
occurred
				
				Click to see stdout/stderrfrom junit_e2e_20191107-194621.xml

Filter through log files


openshift-tests [Feature:OpenShiftControllerManager] TestDeployScale [Suite:openshift/conformance/parallel] 3m3s

go run hack/e2e.go -v -test --test_args='--ginkgo.focus=openshift\-tests\s\[Feature\:OpenShiftControllerManager\]\sTestDeployScale\s\[Suite\:openshift\/conformance\/parallel\]$'
fail [k8s.io/kubernetes/test/e2e/e2e.go:104]: Unexpected error:
    <*url.Error | 0xc003e07bf0>: {
        Op: "Get",
        URL: "https://api.ci-op-35xzfv47-5e7ab.origin-ci-int-aws.dev.rhcloud.com:6443/api/v1/nodes?fieldSelector=spec.unschedulable%3Dfalse&resourceVersion=0",
        Err: {
            Op: "dial",
            Net: "tcp",
            Source: nil,
            Addr: {IP: "\x93KI\xcf", Port: 6443, Zone: ""},
            Err: {},
        },
    }
    Get https://api.ci-op-35xzfv47-5e7ab.origin-ci-int-aws.dev.rhcloud.com:6443/api/v1/nodes?fieldSelector=spec.unschedulable%3Dfalse&resourceVersion=0: dial tcp 147.75.73.207:6443: i/o timeout
occurred
				
				Click to see stdout/stderrfrom junit_e2e_20191107-194621.xml

Filter through log files


openshift-tests [Feature:OpenShiftControllerManager] TestTriggers_configChange [Suite:openshift/conformance/parallel] 4m1s

go run hack/e2e.go -v -test --test_args='--ginkgo.focus=openshift\-tests\s\[Feature\:OpenShiftControllerManager\]\sTestTriggers\_configChange\s\[Suite\:openshift\/conformance\/parallel\]$'
fail [k8s.io/kubernetes/test/e2e/e2e.go:104]: Unexpected error:
    <*url.Error | 0xc0023623f0>: {
        Op: "Get",
        URL: "https://api.ci-op-35xzfv47-5e7ab.origin-ci-int-aws.dev.rhcloud.com:6443/api/v1/nodes?fieldSelector=spec.unschedulable%3Dfalse&resourceVersion=0",
        Err: {
            Op: "dial",
            Net: "tcp",
            Source: nil,
            Addr: {IP: "\x8b\xb2F\xd5", Port: 6443, Zone: ""},
            Err: {},
        },
    }
    Get https://api.ci-op-35xzfv47-5e7ab.origin-ci-int-aws.dev.rhcloud.com:6443/api/v1/nodes?fieldSelector=spec.unschedulable%3Dfalse&resourceVersion=0: dial tcp 139.178.70.213:6443: i/o timeout
occurred
				
				Click to see stdout/stderrfrom junit_e2e_20191107-194621.xml

Filter through log files


openshift-tests [Feature:ProjectAPI] TestInvalidRoleRefs should succeed [Suite:openshift/conformance/parallel] 4m1s

go run hack/e2e.go -v -test --test_args='--ginkgo.focus=openshift\-tests\s\[Feature\:ProjectAPI\]\s\sTestInvalidRoleRefs\sshould\ssucceed\s\[Suite\:openshift\/conformance\/parallel\]$'
fail [k8s.io/kubernetes/test/e2e/e2e.go:104]: Unexpected error:
    <*url.Error | 0xc003ed8000>: {
        Op: "Get",
        URL: "https://api.ci-op-35xzfv47-5e7ab.origin-ci-int-aws.dev.rhcloud.com:6443/api/v1/nodes?fieldSelector=spec.unschedulable%3Dfalse&resourceVersion=0",
        Err: {
            Op: "dial",
            Net: "tcp",
            Source: nil,
            Addr: {IP: "\x8b\xb2F\xd5", Port: 6443, Zone: ""},
            Err: {},
        },
    }
    Get https://api.ci-op-35xzfv47-5e7ab.origin-ci-int-aws.dev.rhcloud.com:6443/api/v1/nodes?fieldSelector=spec.unschedulable%3Dfalse&resourceVersion=0: dial tcp 139.178.70.213:6443: i/o timeout
occurred
				
				Click to see stdout/stderrfrom junit_e2e_20191107-194621.xml

Filter through log files


openshift-tests [Feature:ProjectAPI] TestProjectWatch should succeed [Suite:openshift/conformance/parallel] 6m42s

go run hack/e2e.go -v -test --test_args='--ginkgo.focus=openshift\-tests\s\[Feature\:ProjectAPI\]\s\sTestProjectWatch\sshould\ssucceed\s\[Suite\:openshift\/conformance\/parallel\]$'
fail [github.com/openshift/origin/test/extended/project/project.go:233]: timeout: e2e-test-project-api-qxzh9
				
				Click to see stdout/stderrfrom junit_e2e_20191107-194621.xml

Filter through log files


openshift-tests [Feature:ProjectAPI] TestScopedProjectAccess should succeed [Suite:openshift/conformance/parallel] 8m50s

go run hack/e2e.go -v -test --test_args='--ginkgo.focus=openshift\-tests\s\[Feature\:ProjectAPI\]\s\sTestScopedProjectAccess\sshould\ssucceed\s\[Suite\:openshift\/conformance\/parallel\]$'
fail [github.com/openshift/origin/test/extended/project/project.go:315]: timeout: e2e-test-project-api-ghcz4
				
				Click to see stdout/stderrfrom junit_e2e_20191107-194621.xml

Filter through log files


openshift-tests [Feature:Prometheus][Conformance] Prometheus when installed on the cluster should report less than two alerts in firing or pending state [Suite:openshift/conformance/parallel/minimal] 8m20s

go run hack/e2e.go -v -test --test_args='--ginkgo.focus=openshift\-tests\s\[Feature\:Prometheus\]\[Conformance\]\sPrometheus\swhen\sinstalled\son\sthe\scluster\sshould\sreport\sless\sthan\stwo\salerts\sin\sfiring\sor\spending\sstate\s\[Suite\:openshift\/conformance\/parallel\/minimal\]$'
fail [github.com/openshift/origin/test/extended/prometheus/prometheus_builds.go:130]: Unexpected error:
    <*errors.errorString | 0xc0004b6640>: {
        s: "host command failed: error running &{/usr/bin/kubectl [kubectl --server=https://api.ci-op-35xzfv47-5e7ab.origin-ci-int-aws.dev.rhcloud.com:6443 --kubeconfig=/tmp/admin.kubeconfig exec --namespace=e2e-test-prometheus-j7r6z execpodsdd9q -- /bin/sh -x -c curl -s -k -H 'Authorization: Bearer eyJhbGciOiJSUzI1NiIsImtpZCI6IiJ9.eyJpc3MiOiJrdWJlcm5ldGVzL3NlcnZpY2VhY2NvdW50Iiwia3ViZXJuZXRlcy5pby9zZXJ2aWNlYWNjb3VudC9uYW1lc3BhY2UiOiJvcGVuc2hpZnQtbW9uaXRvcmluZyIsImt1YmVybmV0ZXMuaW8vc2VydmljZWFjY291bnQvc2VjcmV0Lm5hbWUiOiJwcm9tZXRoZXVzLWFkYXB0ZXItdG9rZW4tNms4bWYiLCJrdWJlcm5ldGVzLmlvL3NlcnZpY2VhY2NvdW50L3NlcnZpY2UtYWNjb3VudC5uYW1lIjoicHJvbWV0aGV1cy1hZGFwdGVyIiwia3ViZXJuZXRlcy5pby9zZXJ2aWNlYWNjb3VudC9zZXJ2aWNlLWFjY291bnQudWlkIjoiOTdmYjQ2ZjAtMDE4NC0xMWVhLWFkMTItMGNjNDdhODMxNjZjIiwic3ViIjoic3lzdGVtOnNlcnZpY2VhY2NvdW50Om9wZW5zaGlmdC1tb25pdG9yaW5nOnByb21ldGhldXMtYWRhcHRlciJ9.oiTME6X0TIJiY9wxUKDgrxy2lNK_EtyhXwZOznJa7yqtERzv2xcaUAf_KyOU5QG28PVFYap7s4vkp2dnhMRDqghbZ2V19MGv-vYVqlppg21yl1U8MKlwEBl2tRXpBoNz3MMtFn8TMS3372JeadG6Xv2vwKWKAFMDn7uG6UCJFtxAbZdsD_fCw-GSyqIzwYs1afY5VEihbRNJ8x9xElZ76Fd65TvM-Hf7vsfTrR7IGQIuvor7LvgQTHMEekwyfDZwwt-Z5Z2YrRkzNP6UU_MSF9OkhYuLTXkONmCP6jVqZAe6UUqJJxL37qHU49BsSEKJihFwgCDY8-WFXJp7LhPYIA' \"https://prometheus-k8s.openshift-monitoring.svc:9091/api/v1/query?query=sum%28ALERTS%7Balertstate%3D%22firing%22%7D%29\"] []  <nil>  + curl -s -k -H 'Authorization: Bearer eyJhbGciOiJSUzI1NiIsImtpZCI6IiJ9.eyJpc3MiOiJrdWJlcm5ldGVzL3NlcnZpY2VhY2NvdW50Iiwia3ViZXJuZXRlcy5pby9zZXJ2aWNlYWNjb3VudC9uYW1lc3BhY2UiOiJvcGVuc2hpZnQtbW9uaXRvcmluZyIsImt1YmVybmV0ZXMuaW8vc2VydmljZWFjY291bnQvc2VjcmV0Lm5hbWUiOiJwcm9tZXRoZXVzLWFkYXB0ZXItdG9rZW4tNms4bWYiLCJrdWJlcm5ldGVzLmlvL3NlcnZpY2VhY2NvdW50L3NlcnZpY2UtYWNjb3VudC5uYW1lIjoicHJvbWV0aGV1cy1hZGFwdGVyIiwia3ViZXJuZXRlcy5pby9zZXJ2aWNlYWNjb3VudC9zZXJ2aWNlLWFjY291bnQudWlkIjoiOTdmYjQ2ZjAtMDE4NC0xMWVhLWFkMTItMGNjNDdhODMxNjZjIiwic3ViIjoic3lzdGVtOnNlcnZpY2VhY2NvdW50Om9wZW5zaGlmdC1tb25pdG9yaW5nOnByb21ldGhldXMtYWRhcHRlciJ9.oiTME6X0TIJiY9wxUKDgrxy2lNK_EtyhXwZOznJa7yqtERzv2xcaUAf_KyOU5QG28PVFYap7s4vkp2dnhMRDqghbZ2V19MGv-vYVqlppg21yl1U8MKlwEBl2tRXpBoNz3MMtFn8TMS3372JeadG6Xv2vwKWKAFMDn7uG6UCJFtxAbZdsD_fCw-GSyqIzwYs1afY5VEihbRNJ8x9xElZ76Fd65TvM-Hf7vsfTrR7IGQIuvor7LvgQTHMEekwyfDZwwt-Z5Z2YrRkzNP6UU_MSF9OkhYuLTXkONmCP6jVqZAe6UUqJJxL37qHU49BsSEKJihFwgCDY8-WFXJp7LhPYIA' 'https://prometheus-k8s.openshift-monitoring.svc:9091/api/v1/query?query=sum%28ALERTS%7Balertstate%3D%22firing%22%7D%29'\ncommand terminated with exit code 6\n [] <nil> 0xc001ccd0b0 exit status 6 <nil> <nil> true [0xc000825210 0xc0008252f8 0xc0008253b8] [0xc000825210 0xc0008252f8 0xc0008253b8] [0xc000825288 0xc000825340] [0x95bef0 0x95bef0] 0xc00294d980 <nil>}:\nCommand stdout:\n\nstderr:\n+ curl -s -k -H 'Authorization: Bearer eyJhbGciOiJSUzI1NiIsImtpZCI6IiJ9.eyJpc3MiOiJrdWJlcm5ldGVzL3NlcnZpY2VhY2NvdW50Iiwia3ViZXJuZXRlcy5pby9zZXJ2aWNlYWNjb3VudC9uYW1lc3BhY2UiOiJvcGVuc2hpZnQtbW9uaXRvcmluZyIsImt1YmVybmV0ZXMuaW8vc2VydmljZWFjY291bnQvc2VjcmV0Lm5hbWUiOiJwcm9tZXRoZXVzLWFkYXB0ZXItdG9rZW4tNms4bWYiLCJrdWJlcm5ldGVzLmlvL3NlcnZpY2VhY2NvdW50L3NlcnZpY2UtYWNjb3VudC5uYW1lIjoicHJvbWV0aGV1cy1hZGFwdGVyIiwia3ViZXJuZXRlcy5pby9zZXJ2aWNlYWNjb3VudC9zZXJ2aWNlLWFjY291bnQudWlkIjoiOTdmYjQ2ZjAtMDE4NC0xMWVhLWFkMTItMGNjNDdhODMxNjZjIiwic3ViIjoic3lzdGVtOnNlcnZpY2VhY2NvdW50Om9wZW5zaGlmdC1tb25pdG9yaW5nOnByb21ldGhldXMtYWRhcHRlciJ9.oiTME6X0TIJiY9wxUKDgrxy2lNK_EtyhXwZOznJa7yqtERzv2xcaUAf_KyOU5QG28PVFYap7s4vkp2dnhMRDqghbZ2V19MGv-vYVqlppg21yl1U8MKlwEBl2tRXpBoNz3MMtFn8TMS3372JeadG6Xv2vwKWKAFMDn7uG6UCJFtxAbZdsD_fCw-GSyqIzwYs1afY5VEihbRNJ8x9xElZ76Fd65TvM-Hf7vsfTrR7IGQIuvor7LvgQTHMEekwyfDZwwt-Z5Z2YrRkzNP6UU_MSF9OkhYuLTXkONmCP6jVqZAe6UUqJJxL37qHU49BsSEKJihFwgCDY8-WFXJp7LhPYIA' 'https://prometheus-k8s.openshift-monitoring.svc:9091/api/v1/query?query=sum%28ALERTS%7Balertstate%3D%22firing%22%7D%29'\ncommand terminated with exit code 6\n\nerror:\nexit status 6\n\n",
    }
    host command failed: error running &{/usr/bin/kubectl [kubectl --server=https://api.ci-op-35xzfv47-5e7ab.origin-ci-int-aws.dev.rhcloud.com:6443 --kubeconfig=/tmp/admin.kubeconfig exec --namespace=e2e-test-prometheus-j7r6z execpodsdd9q -- /bin/sh -x -c curl -s -k -H 'Authorization: Bearer eyJhbGciOiJSUzI1NiIsImtpZCI6IiJ9.eyJpc3MiOiJrdWJlcm5ldGVzL3NlcnZpY2VhY2NvdW50Iiwia3ViZXJuZXRlcy5pby9zZXJ2aWNlYWNjb3VudC9uYW1lc3BhY2UiOiJvcGVuc2hpZnQtbW9uaXRvcmluZyIsImt1YmVybmV0ZXMuaW8vc2VydmljZWFjY291bnQvc2VjcmV0Lm5hbWUiOiJwcm9tZXRoZXVzLWFkYXB0ZXItdG9rZW4tNms4bWYiLCJrdWJlcm5ldGVzLmlvL3NlcnZpY2VhY2NvdW50L3NlcnZpY2UtYWNjb3VudC5uYW1lIjoicHJvbWV0aGV1cy1hZGFwdGVyIiwia3ViZXJuZXRlcy5pby9zZXJ2aWNlYWNjb3VudC9zZXJ2aWNlLWFjY291bnQudWlkIjoiOTdmYjQ2ZjAtMDE4NC0xMWVhLWFkMTItMGNjNDdhODMxNjZjIiwic3ViIjoic3lzdGVtOnNlcnZpY2VhY2NvdW50Om9wZW5zaGlmdC1tb25pdG9yaW5nOnByb21ldGhldXMtYWRhcHRlciJ9.oiTME6X0TIJiY9wxUKDgrxy2lNK_EtyhXwZOznJa7yqtERzv2xcaUAf_KyOU5QG28PVFYap7s4vkp2dnhMRDqghbZ2V19MGv-vYVqlppg21yl1U8MKlwEBl2tRXpBoNz3MMtFn8TMS3372JeadG6Xv2vwKWKAFMDn7uG6UCJFtxAbZdsD_fCw-GSyqIzwYs1afY5VEihbRNJ8x9xElZ76Fd65TvM-Hf7vsfTrR7IGQIuvor7LvgQTHMEekwyfDZwwt-Z5Z2YrRkzNP6UU_MSF9OkhYuLTXkONmCP6jVqZAe6UUqJJxL37qHU49BsSEKJihFwgCDY8-WFXJp7LhPYIA' "https://prometheus-k8s.openshift-monitoring.svc:9091/api/v1/query?query=sum%28ALERTS%7Balertstate%3D%22firing%22%7D%29"] []  <nil>  + curl -s -k -H 'Authorization: Bearer eyJhbGciOiJSUzI1NiIsImtpZCI6IiJ9.eyJpc3MiOiJrdWJlcm5ldGVzL3NlcnZpY2VhY2NvdW50Iiwia3ViZXJuZXRlcy5pby9zZXJ2aWNlYWNjb3VudC9uYW1lc3BhY2UiOiJvcGVuc2hpZnQtbW9uaXRvcmluZyIsImt1YmVybmV0ZXMuaW8vc2VydmljZWFjY291bnQvc2VjcmV0Lm5hbWUiOiJwcm9tZXRoZXVzLWFkYXB0ZXItdG9rZW4tNms4bWYiLCJrdWJlcm5ldGVzLmlvL3NlcnZpY2VhY2NvdW50L3NlcnZpY2UtYWNjb3VudC5uYW1lIjoicHJvbWV0aGV1cy1hZGFwdGVyIiwia3ViZXJuZXRlcy5pby9zZXJ2aWNlYWNjb3VudC9zZXJ2aWNlLWFjY291bnQudWlkIjoiOTdmYjQ2ZjAtMDE4NC0xMWVhLWFkMTItMGNjNDdhODMxNjZjIiwic3ViIjoic3lzdGVtOnNlcnZpY2VhY2NvdW50Om9wZW5zaGlmdC1tb25pdG9yaW5nOnByb21ldGhldXMtYWRhcHRlciJ9.oiTME6X0TIJiY9wxUKDgrxy2lNK_EtyhXwZOznJa7yqtERzv2xcaUAf_KyOU5QG28PVFYap7s4vkp2dnhMRDqghbZ2V19MGv-vYVqlppg21yl1U8MKlwEBl2tRXpBoNz3MMtFn8TMS3372JeadG6Xv2vwKWKAFMDn7uG6UCJFtxAbZdsD_fCw-GSyqIzwYs1afY5VEihbRNJ8x9xElZ76Fd65TvM-Hf7vsfTrR7IGQIuvor7LvgQTHMEekwyfDZwwt-Z5Z2YrRkzNP6UU_MSF9OkhYuLTXkONmCP6jVqZAe6UUqJJxL37qHU49BsSEKJihFwgCDY8-WFXJp7LhPYIA' 'https://prometheus-k8s.openshift-monitoring.svc:9091/api/v1/query?query=sum%28ALERTS%7Balertstate%3D%22firing%22%7D%29'
    command terminated with exit code 6
     [] <nil> 0xc001ccd0b0 exit status 6 <nil> <nil> true [0xc000825210 0xc0008252f8 0xc0008253b8] [0xc000825210 0xc0008252f8 0xc0008253b8] [0xc000825288 0xc000825340] [0x95bef0 0x95bef0] 0xc00294d980 <nil>}:
    Command stdout:
    
    stderr:
    + curl -s -k -H 'Authorization: Bearer eyJhbGciOiJSUzI1NiIsImtpZCI6IiJ9.eyJpc3MiOiJrdWJlcm5ldGVzL3NlcnZpY2VhY2NvdW50Iiwia3ViZXJuZXRlcy5pby9zZXJ2aWNlYWNjb3VudC9uYW1lc3BhY2UiOiJvcGVuc2hpZnQtbW9uaXRvcmluZyIsImt1YmVybmV0ZXMuaW8vc2VydmljZWFjY291bnQvc2VjcmV0Lm5hbWUiOiJwcm9tZXRoZXVzLWFkYXB0ZXItdG9rZW4tNms4bWYiLCJrdWJlcm5ldGVzLmlvL3NlcnZpY2VhY2NvdW50L3NlcnZpY2UtYWNjb3VudC5uYW1lIjoicHJvbWV0aGV1cy1hZGFwdGVyIiwia3ViZXJuZXRlcy5pby9zZXJ2aWNlYWNjb3VudC9zZXJ2aWNlLWFjY291bnQudWlkIjoiOTdmYjQ2ZjAtMDE4NC0xMWVhLWFkMTItMGNjNDdhODMxNjZjIiwic3ViIjoic3lzdGVtOnNlcnZpY2VhY2NvdW50Om9wZW5zaGlmdC1tb25pdG9yaW5nOnByb21ldGhldXMtYWRhcHRlciJ9.oiTME6X0TIJiY9wxUKDgrxy2lNK_EtyhXwZOznJa7yqtERzv2xcaUAf_KyOU5QG28PVFYap7s4vkp2dnhMRDqghbZ2V19MGv-vYVqlppg21yl1U8MKlwEBl2tRXpBoNz3MMtFn8TMS3372JeadG6Xv2vwKWKAFMDn7uG6UCJFtxAbZdsD_fCw-GSyqIzwYs1afY5VEihbRNJ8x9xElZ76Fd65TvM-Hf7vsfTrR7IGQIuvor7LvgQTHMEekwyfDZwwt-Z5Z2YrRkzNP6UU_MSF9OkhYuLTXkONmCP6jVqZAe6UUqJJxL37qHU49BsSEKJihFwgCDY8-WFXJp7LhPYIA' 'https://prometheus-k8s.openshift-monitoring.svc:9091/api/v1/query?query=sum%28ALERTS%7Balertstate%3D%22firing%22%7D%29'
    command terminated with exit code 6
    
    error:
    exit status 6
    
    
occurred
				
				Click to see stdout/stderrfrom junit_e2e_20191107-194621.xml

Filter through log files


openshift-tests [Feature:Prometheus][Conformance] Prometheus when installed on the cluster should start and expose a secured proxy and unsecured metrics [Suite:openshift/conformance/parallel/minimal] 3m19s

go run hack/e2e.go -v -test --test_args='--ginkgo.focus=openshift\-tests\s\[Feature\:Prometheus\]\[Conformance\]\sPrometheus\swhen\sinstalled\son\sthe\scluster\sshould\sstart\sand\sexpose\sa\ssecured\sproxy\sand\sunsecured\smetrics\s\[Suite\:openshift\/conformance\/parallel\/minimal\]$'
fail [k8s.io/kubernetes/test/e2e/e2e.go:104]: Unexpected error:
    <*url.Error | 0xc003e8c240>: {
        Op: "Get",
        URL: "https://api.ci-op-35xzfv47-5e7ab.origin-ci-int-aws.dev.rhcloud.com:6443/api/v1/nodes?fieldSelector=spec.unschedulable%3Dfalse&resourceVersion=0",
        Err: {
            Op: "dial",
            Net: "tcp",
            Source: nil,
            Addr: {IP: "\x8b\xb2F\xd7", Port: 6443, Zone: ""},
            Err: {},
        },
    }
    Get https://api.ci-op-35xzfv47-5e7ab.origin-ci-int-aws.dev.rhcloud.com:6443/api/v1/nodes?fieldSelector=spec.unschedulable%3Dfalse&resourceVersion=0: dial tcp 139.178.70.215:6443: i/o timeout
occurred
				
				Click to see stdout/stderrfrom junit_e2e_20191107-194621.xml

Filter through log files


openshift-tests [Feature:Prometheus][Conformance] Prometheus when installed on the cluster when using openshift-sdn should be able to get the sdn ovs flows [Suite:openshift/conformance/parallel/minimal] 4m1s

go run hack/e2e.go -v -test --test_args='--ginkgo.focus=openshift\-tests\s\[Feature\:Prometheus\]\[Conformance\]\sPrometheus\swhen\sinstalled\son\sthe\scluster\swhen\susing\sopenshift\-sdn\sshould\sbe\sable\sto\sget\sthe\ssdn\sovs\sflows\s\[Suite\:openshift\/conformance\/parallel\/minimal\]$'
fail [k8s.io/kubernetes/test/e2e/e2e.go:104]: Unexpected error:
    <*url.Error | 0xc002e1e030>: {
        Op: "Get",
        URL: "https://api.ci-op-35xzfv47-5e7ab.origin-ci-int-aws.dev.rhcloud.com:6443/api/v1/nodes?fieldSelector=spec.unschedulable%3Dfalse&resourceVersion=0",
        Err: {
            Op: "dial",
            Net: "tcp",
            Source: nil,
            Addr: {IP: "\x93KI\xcf", Port: 6443, Zone: ""},
            Err: {},
        },
    }
    Get https://api.ci-op-35xzfv47-5e7ab.origin-ci-int-aws.dev.rhcloud.com:6443/api/v1/nodes?fieldSelector=spec.unschedulable%3Dfalse&resourceVersion=0: dial tcp 147.75.73.207:6443: i/o timeout
occurred
				
				Click to see stdout/stderrfrom junit_e2e_20191107-194621.xml

Filter through log files


openshift-tests [cli] oc adm must-gather runs successfully [Suite:openshift/conformance/parallel] 15m0s

go run hack/e2e.go -v -test --test_args='--ginkgo.focus=openshift\-tests\s\[cli\]\soc\sadm\smust\-gather\sruns\ssuccessfully\s\[Suite\:openshift\/conformance\/parallel\]$'
[must-gather-l9hxx] OUT namespaces/openshift-service-catalog-apiserver-operator/pods/openshift-service-catalog-apiserver-operator-567658f5cf-ht4kl/operator/operator/logs/current.log
[must-gather-l9hxx] OUT namespaces/openshift-service-catalog-apiserver-operator/pods/openshift-service-catalog-apiserver-operator-567658f5cf-ht4kl/operator/operator/logs/previous.log
[must-gather-l9hxx] OUT namespaces/openshift-service-catalog-apiserver-operator/route.openshift.io/
[must-gather-l9hxx] OUT namespaces/openshift-service-catalog-apiserver-operator/route.openshift.io/routes.yaml
[must-gather-l9hxx] OUT namespaces/openshift-service-catalog-controller-manager-operator/
[must-gather-l9hxx] OUT namespaces/openshift-service-catalog-controller-manager-operator/openshift-service-catalog-controller-manager-operator.yaml
[must-gather-l9hxx] OUT namespaces/openshift-service-catalog-controller-manager-operator/apps.openshift.io/
[must-gather-l9hxx] OUT namespaces/openshift-service-catalog-controller-manager-operator/apps.openshift.io/deploymentconfigs.yaml
[must-gather-l9hxx] OUT namespaces/openshift-service-catalog-controller-manager-operator/apps/
[must-gather-l9hxx] OUT namespaces/openshift-service-catalog-controller-manager-operator/apps/daemonsets.yaml
[must-gather-l9hxx] OUT namespaces/openshift-service-catalog-controller-manager-operator/apps/deployments.yaml
[must-gather-l9hxx] OUT namespaces/openshift-service-catalog-controller-manager-operator/apps/replicasets.yaml
[must-gather-l9hxx] OUT namespaces/openshift-service-catalog-controller-manager-operator/apps/statefulsets.yaml
[must-gather-l9hxx] OUT namespaces/openshift-service-catalog-controller-manager-operator/autoscaling/
[must-gather-l9hxx] OUT namespaces/openshift-service-catalog-controller-manager-operator/autoscaling/horizontalpodautoscalers.yaml
[must-gather-l9hxx] OUT namespaces/openshift-service-catalog-controller-manager-operator/batch/
[must-gather-l9hxx] OUT namespaces/openshift-service-catalog-controller-manager-operator/batch/cronjobs.yaml
[must-gather-l9hxx] OUT namespaces/openshift-service-catalog-controller-manager-operator/batch/jobs.yaml
[must-gather-l9hxx] OUT namespaces/openshift-service-catalog-controller-manager-operator/build.openshift.io/
[must-gather-l9hxx] OUT namespaces/openshift-service-catalog-controller-manager-operator/build.openshift.io/buildconfigs.yaml
[must-gather-l9hxx] OUT namespaces/openshift-service-catalog-controller-manager-operator/build.openshift.io/builds.yaml
[must-gather-l9hxx] OUT namespaces/openshift-service-catalog-controller-manager-operator/core/
[must-gather-l9hxx] OUT namespaces/openshift-service-catalog-controller-manager-operator/core/configmaps.yaml
[must-gather-l9hxx] OUT namespaces/openshift-service-catalog-controller-manager-operator/core/events.yaml
[must-gather-l9hxx] OUT namespaces/openshift-service-catalog-controller-manager-operator/core/persistentvolumeclaims.yaml
[must-gather-l9hxx] OUT namespaces/openshift-service-catalog-controller-manager-operator/core/pods.yaml
[must-gather-l9hxx] OUT namespaces/openshift-service-catalog-controller-manager-operator/core/replicationcontrollers.yaml
[must-gather-l9hxx] OUT namespaces/openshift-service-catalog-controller-manager-operator/core/secrets.yaml
[must-gather-l9hxx] OUT namespaces/openshift-service-catalog-controller-manager-operator/core/services.yaml
[must-gather-l9hxx] OUT namespaces/openshift-service-catalog-controller-manager-operator/image.openshift.io/
[must-gather-l9hxx] OUT namespaces/openshift-service-catalog-controller-manager-operator/image.openshift.io/imagestreams.yaml
[must-gather-l9hxx] OUT namespaces/openshift-service-catalog-controller-manager-operator/pods/
[must-gather-l9hxx] OUT namespaces/openshift-service-catalog-controller-manager-operator/pods/openshift-service-catalog-controller-manager-operator-d768cxkgh/
[must-gather-l9hxx] OUT namespaces/openshift-service-catalog-controller-manager-operator/pods/openshift-service-catalog-controller-manager-operator-d768cxkgh/openshift-service-catalog-controller-manager-operator-d768cxkgh.yaml
[must-gather-l9hxx] OUT namespaces/openshift-service-catalog-controller-manager-operator/pods/openshift-service-catalog-controller-manager-operator-d768cxkgh/operator/
[must-gather-l9hxx] OUT namespaces/openshift-service-catalog-controller-manager-operator/pods/openshift-service-catalog-controller-manager-operator-d768cxkgh/operator/operator/
[must-gather-l9hxx] OUT namespaces/openshift-service-catalog-controller-manager-operator/pods/openshift-service-catalog-controller-manager-operator-d768cxkgh/operator/operator/healthz/
[must-gather-l9hxx] OUT namespaces/openshift-service-catalog-controller-manager-operator/pods/openshift-service-catalog-controller-manager-operator-d768cxkgh/operator/operator/logs/
[must-gather-l9hxx] OUT namespaces/openshift-service-catalog-controller-manager-operator/pods/openshift-service-catalog-controller-manager-operator-d768cxkgh/operator/operator/logs/current.log
[must-gather-l9hxx] OUT namespaces/openshift-service-catalog-controller-manager-operator/pods/openshift-service-catalog-controller-manager-operator-d768cxkgh/operator/operator/logs/previous.log
[must-gather-l9hxx] OUT namespaces/openshift-service-catalog-controller-manager-operator/route.openshift.io/
[must-gather-l9hxx] OUT namespaces/openshift-service-catalog-controller-manager-operator/route.openshift.io/routes.yaml
[must-gather-l9hxx] OUT namespaces/openshift/
[must-gather-l9hxx] OUT namespaces/openshift/openshift.yaml
[must-gather-l9hxx] OUT namespaces/openshift/apps.openshift.io/
[must-gather-l9hxx] OUT namespaces/openshift/apps.openshift.io/deploymentconfigs.yaml
[must-gather-l9hxx] OUT namespaces/openshift/apps/
[must-gather-l9hxx] OUT namespaces/openshift/apps/daemonsets.yaml
[must-gather-l9hxx] OUT namespaces/openshift/apps/deployments.yaml
[must-gather-l9hxx] OUT namespaces/openshift/apps/replicasets.yaml
[must-gather-l9hxx] OUT namespaces/openshift/apps/statefulsets.yaml
[must-gather-l9hxx] OUT namespaces/openshift/autoscaling/
[must-gather-l9hxx] OUT namespaces/openshift/autoscaling/horizontalpodautoscalers.yaml
[must-gather-l9hxx] OUT namespaces/openshift/batch/
[must-gather-l9hxx] OUT namespaces/openshift/batch/cronjobs.yaml
[must-gather-l9hxx] OUT namespaces/openshift/batch/jobs.yaml
[must-gather-l9hxx] OUT namespaces/openshift/build.openshift.io/
[must-gather-l9hxx] OUT namespaces/openshift/build.openshift.io/buildconfigs.yaml
[must-gather-l9hxx] OUT namespaces/openshift/build.openshift.io/builds.yaml
[must-gather-l9hxx] OUT namespaces/openshift/core/
[must-gather-l9hxx] OUT namespaces/openshift/core/configmaps.yaml
[must-gather-l9hxx] OUT namespaces/openshift/core/events.yaml
[must-gather-l9hxx] OUT namespaces/openshift/core/persistentvolumeclaims.yaml
[must-gather-l9hxx] OUT namespaces/openshift/core/pods.yaml
[must-gather-l9hxx] OUT namespaces/openshift/core/replicationcontrollers.yaml
[must-gather-l9hxx] OUT namespaces/openshift/core/secrets.yaml
[must-gather-l9hxx] OUT namespaces/openshift/core/services.yaml
[must-gather-l9hxx] OUT namespaces/openshift/image.openshift.io/
[must-gather-l9hxx] OUT namespaces/openshift/image.openshift.io/imagestreams.yaml
[must-gather-l9hxx] OUT namespaces/openshift/route.openshift.io/
[must-gather-l9hxx] OUT namespaces/openshift/route.openshift.io/routes.yaml
[must-gather-l9hxx] OUT 
[must-gather-l9hxx] OUT sent 36,910 bytes  received 171,813,487 bytes  13,748,031.76 bytes/sec
[must-gather-l9hxx] OUT total size is 171,599,210  speedup is 1.00
[must-gather      ] OUT clusterrolebinding.rbac.authorization.k8s.io/must-gather-99tfr deleted
[must-gather      ] OUT namespace/openshift-must-gather-4xh9n deleted
STEP: /tmp/test.oc-adm-must-gather.350157542/quay-io-openshift-release-dev-ocp-v4-0-art-dev-sha256-2bebbc3d547d70cb8caea206a567642f5ab1c7e098ddba55bf7e64b5c58534f2/audit_logs/kube-apiserver
STEP: /tmp/test.oc-adm-must-gather.350157542/quay-io-openshift-release-dev-ocp-v4-0-art-dev-sha256-2bebbc3d547d70cb8caea206a567642f5ab1c7e098ddba55bf7e64b5c58534f2/audit_logs/kube-apiserver/master-0.ci-op-35xzfv47-5e7ab.origin-ci-int-aws.dev.rhcloud.com-audit-2019-11-07T18-04-04.688.log.gz
STEP: /tmp/test.oc-adm-must-gather.350157542/quay-io-openshift-release-dev-ocp-v4-0-art-dev-sha256-2bebbc3d547d70cb8caea206a567642f5ab1c7e098ddba55bf7e64b5c58534f2/audit_logs/kube-apiserver/master-0.ci-op-35xzfv47-5e7ab.origin-ci-int-aws.dev.rhcloud.com-audit-2019-11-07T18-29-15.292.log.gz
STEP: /tmp/test.oc-adm-must-gather.350157542/quay-io-openshift-release-dev-ocp-v4-0-art-dev-sha256-2bebbc3d547d70cb8caea206a567642f5ab1c7e098ddba55bf7e64b5c58534f2/audit_logs/kube-apiserver/master-0.ci-op-35xzfv47-5e7ab.origin-ci-int-aws.dev.rhcloud.com-audit.log.gz
STEP: /tmp/test.oc-adm-must-gather.350157542/quay-io-openshift-release-dev-ocp-v4-0-art-dev-sha256-2bebbc3d547d70cb8caea206a567642f5ab1c7e098ddba55bf7e64b5c58534f2/audit_logs/kube-apiserver/master-1.ci-op-35xzfv47-5e7ab.origin-ci-int-aws.dev.rhcloud.com-audit-2019-11-07T18-17-08.084.log.gz
[AfterEach] [cli] oc adm must-gather
  /go/src/github.com/openshift/origin/_output/local/go/src/github.com/openshift/origin/test/extended/util/client.go:101
STEP: Collecting events from namespace "e2e-test-oc-adm-must-gather-cshzs".
STEP: Found 0 events.
Nov  7 18:39:31.763: INFO: POD  NODE  PHASE  GRACE  CONDITIONS
Nov  7 18:39:31.763: INFO: 
Nov  7 18:39:32.189: INFO: skipping dumping cluster info - cluster too large
Nov  7 18:39:32.860: INFO: Deleted {user.openshift.io/v1, Resource=users  e2e-test-oc-adm-must-gather-cshzs-user}, err: <nil>
Nov  7 18:39:33.277: INFO: Deleted {oauth.openshift.io/v1, Resource=oauthclients  e2e-client-e2e-test-oc-adm-must-gather-cshzs}, err: <nil>
Nov  7 18:39:33.762: INFO: Deleted {oauth.openshift.io/v1, Resource=oauthaccesstokens  sD1sbTjkQmabuaHMsqEafQAAAAAAAAAA}, err: <nil>
[AfterEach] [cli] oc adm must-gather
  /go/src/github.com/openshift/origin/_output/local/go/src/github.com/openshift/origin/vendor/k8s.io/kubernetes/test/e2e/framework/framework.go:150
Nov  7 18:39:33.762: INFO: Waiting up to 3m0s for all (but 100) nodes to be ready
STEP: Destroying namespace "e2e-test-oc-adm-must-gather-cshzs" for this suite.

---------------------------------------------------------
Received interrupt.  Running AfterSuite...
^C again to terminate immediately
Nov  7 18:39:54.704: INFO: Running AfterSuite actions on all nodes
Nov  7 18:39:54.704: INFO: Running AfterSuite actions on node 1