ResultFAILURE
Tests 49 failed / 34 succeeded
Started2019-11-05 11:23
Elapsed3h35m
Work namespaceci-op-6s5tcgwg
pod4.2.0-0.nightly-2019-11-05-111920-metal-serial

Test Failures


openshift-tests Monitor cluster while tests execute 2h29m

go run hack/e2e.go -v -test --test_args='--ginkgo.focus=openshift\-tests\sMonitor\scluster\swhile\stests\sexecute$'
28 error level events were detected during this test run:

Nov 05 12:46:59.989 E ns/openshift-monitoring pod/openshift-state-metrics-557985667-57bqt node/worker-1.ci-op-6s5tcgwg-a4af7.origin-ci-int-aws.dev.rhcloud.com container=openshift-state-metrics container exited with code 2 (Error): 
Nov 05 12:47:02.679 E ns/openshift-monitoring pod/alertmanager-main-1 node/worker-1.ci-op-6s5tcgwg-a4af7.origin-ci-int-aws.dev.rhcloud.com container=config-reloader container exited with code 2 (Error): 
Nov 05 12:47:02.679 E ns/openshift-monitoring pod/alertmanager-main-1 node/worker-1.ci-op-6s5tcgwg-a4af7.origin-ci-int-aws.dev.rhcloud.com container=alertmanager-proxy container exited with code 2 (Error): 2019/11/05 12:23:35 provider.go:109: Defaulting client-id to system:serviceaccount:openshift-monitoring:alertmanager-main\n2019/11/05 12:23:35 provider.go:114: Defaulting client-secret to service account token /var/run/secrets/kubernetes.io/serviceaccount/token\n2019/11/05 12:23:35 provider.go:291: Delegation of authentication and authorization to OpenShift is enabled for bearer tokens and client certificates.\n2019/11/05 12:23:35 oauthproxy.go:200: mapping path "/" => upstream "http://localhost:9093/"\n2019/11/05 12:23:35 oauthproxy.go:221: compiled skip-auth-regex => "^/metrics"\n2019/11/05 12:23:35 oauthproxy.go:227: OAuthProxy configured for  Client ID: system:serviceaccount:openshift-monitoring:alertmanager-main\n2019/11/05 12:23:35 oauthproxy.go:237: Cookie settings: name:_oauth_proxy secure(https):true httponly:true expiry:168h0m0s domain:<default> refresh:disabled\n2019/11/05 12:23:35 http.go:96: HTTPS: listening on [::]:9095\n
Nov 05 12:47:03.773 E ns/openshift-console pod/downloads-6674c66cf4-2jrxr node/worker-1.ci-op-6s5tcgwg-a4af7.origin-ci-int-aws.dev.rhcloud.com container=download-server container exited with code 137 (Error): 9 12:44:10] "GET / HTTP/1.1" 200 -\n10.128.0.1 - - [05/Nov/2019 12:44:13] "GET / HTTP/1.1" 200 -\n10.128.0.1 - - [05/Nov/2019 12:44:20] "GET / HTTP/1.1" 200 -\n10.128.0.1 - - [05/Nov/2019 12:44:23] "GET / HTTP/1.1" 200 -\n10.128.0.1 - - [05/Nov/2019 12:44:30] "GET / HTTP/1.1" 200 -\n10.128.0.1 - - [05/Nov/2019 12:44:33] "GET / HTTP/1.1" 200 -\n10.128.0.1 - - [05/Nov/2019 12:44:40] "GET / HTTP/1.1" 200 -\n10.128.0.1 - - [05/Nov/2019 12:44:43] "GET / HTTP/1.1" 200 -\n10.128.0.1 - - [05/Nov/2019 12:44:50] "GET / HTTP/1.1" 200 -\n10.128.0.1 - - [05/Nov/2019 12:44:53] "GET / HTTP/1.1" 200 -\n10.128.0.1 - - [05/Nov/2019 12:45:00] "GET / HTTP/1.1" 200 -\n10.128.0.1 - - [05/Nov/2019 12:45:03] "GET / HTTP/1.1" 200 -\n10.128.0.1 - - [05/Nov/2019 12:45:10] "GET / HTTP/1.1" 200 -\n10.128.0.1 - - [05/Nov/2019 12:45:13] "GET / HTTP/1.1" 200 -\n10.128.0.1 - - [05/Nov/2019 12:45:20] "GET / HTTP/1.1" 200 -\n10.128.0.1 - - [05/Nov/2019 12:45:23] "GET / HTTP/1.1" 200 -\n10.128.0.1 - - [05/Nov/2019 12:45:30] "GET / HTTP/1.1" 200 -\n10.128.0.1 - - [05/Nov/2019 12:45:33] "GET / HTTP/1.1" 200 -\n10.128.0.1 - - [05/Nov/2019 12:45:40] "GET / HTTP/1.1" 200 -\n10.128.0.1 - - [05/Nov/2019 12:45:43] "GET / HTTP/1.1" 200 -\n10.128.0.1 - - [05/Nov/2019 12:45:50] "GET / HTTP/1.1" 200 -\n10.128.0.1 - - [05/Nov/2019 12:45:53] "GET / HTTP/1.1" 200 -\n10.128.0.1 - - [05/Nov/2019 12:46:00] "GET / HTTP/1.1" 200 -\n10.128.0.1 - - [05/Nov/2019 12:46:03] "GET / HTTP/1.1" 200 -\n10.128.0.1 - - [05/Nov/2019 12:46:10] "GET / HTTP/1.1" 200 -\n10.128.0.1 - - [05/Nov/2019 12:46:13] "GET / HTTP/1.1" 200 -\n10.128.0.1 - - [05/Nov/2019 12:46:20] "GET / HTTP/1.1" 200 -\n10.128.0.1 - - [05/Nov/2019 12:46:23] "GET / HTTP/1.1" 200 -\n10.128.0.1 - - [05/Nov/2019 12:46:30] "GET / HTTP/1.1" 200 -\n10.128.0.1 - - [05/Nov/2019 12:46:33] "GET / HTTP/1.1" 200 -\n10.128.0.1 - - [05/Nov/2019 12:46:40] "GET / HTTP/1.1" 200 -\n10.128.0.1 - - [05/Nov/2019 12:46:43] "GET / HTTP/1.1" 200 -\n10.128.0.1 - - [05/Nov/2019 12:46:50] "GET / HTTP/1.1" 200 -\n10.128.0.1 - - [05/Nov/2019 12:46:53] "GET / HTTP/1.1" 200 -\n
Nov 05 12:47:26.249 E ns/openshift-monitoring pod/prometheus-k8s-1 node/worker-0.ci-op-6s5tcgwg-a4af7.origin-ci-int-aws.dev.rhcloud.com container=prometheus container exited with code 1 (Error): 
Nov 05 14:43:48.960 E ns/openshift-cloud-credential-operator pod/cloud-credential-operator-5d9f4d59bd-47w96 node/master-2.ci-op-6s5tcgwg-a4af7.origin-ci-int-aws.dev.rhcloud.com container=manager container exited with code 1 (Error): uest=openshift-ingress error="unsupported platorm type: None"\ntime="2019-11-05T14:42:24Z" level=warning msg="ignoring for status condition because could not decode provider spec" credentialsRequest=openshift-ingress-azure error="unsupported platorm type: None"\ntime="2019-11-05T14:42:24Z" level=warning msg="ignoring for status condition because could not decode provider spec" credentialsRequest=openshift-ingress-gcp error="unsupported platorm type: None"\ntime="2019-11-05T14:42:24Z" level=warning msg="ignoring for status condition because could not decode provider spec" credentialsRequest=openshift-machine-api-aws error="unsupported platorm type: None"\ntime="2019-11-05T14:42:24Z" level=warning msg="ignoring for status condition because could not decode provider spec" credentialsRequest=openshift-machine-api-azure error="unsupported platorm type: None"\ntime="2019-11-05T14:42:24Z" level=warning msg="ignoring for status condition because could not decode provider spec" credentialsRequest=openshift-machine-api-gcp error="unsupported platorm type: None"\ntime="2019-11-05T14:42:24Z" level=warning msg="ignoring for status condition because could not decode provider spec" credentialsRequest=openshift-machine-api-openstack error="unsupported platorm type: None"\ntime="2019-11-05T14:42:24Z" level=debug msg="0 cred requests"\ntime="2019-11-05T14:42:24Z" level=debug msg="set ClusterOperator condition" message="No credentials requests reporting errors." reason=NoCredentialsFailing status=False type=Degraded\ntime="2019-11-05T14:42:24Z" level=debug msg="set ClusterOperator condition" message="0 of 0 credentials requests provisioned and reconciled." reason=ReconcilingComplete status=False type=Progressing\ntime="2019-11-05T14:42:24Z" level=debug msg="set ClusterOperator condition" message= reason= status=True type=Available\ntime="2019-11-05T14:42:24Z" level=debug msg="set ClusterOperator condition" message= reason= status=True type=Upgradeable\ntime="2019-11-05T14:43:48Z" level=error msg="leader election lostunable to run the manager"\n
Nov 05 14:43:52.863 - 14s   E openshift-apiserver OpenShift API is not responding to GET requests
Nov 05 14:44:14.002 E ns/openshift-kube-controller-manager-operator pod/kube-controller-manager-operator-6bfc44dc74-b74zp node/master-2.ci-op-6s5tcgwg-a4af7.origin-ci-int-aws.dev.rhcloud.com container=kube-controller-manager-operator container exited with code 255 (Error): ector.go:289] k8s.io/client-go/informers/factory.go:133: watch of *v1.RoleBinding ended with: too old resource version: 49927 (51320)\nE1105 14:43:45.568956       1 leaderelection.go:341] Failed to update lock: etcdserver: request timed out, possibly due to previous leader failure\nI1105 14:44:13.090834       1 event.go:209] Event(v1.ObjectReference{Kind:"Deployment", Namespace:"openshift-kube-controller-manager-operator", Name:"kube-controller-manager-operator", UID:"9d73e9a5-ffc5-11e9-a984-ac1f6b9985f4", APIVersion:"apps/v1", ResourceVersion:"", FieldPath:""}): type: 'Normal' reason: 'OperatorStatusChanged' Status for clusteroperator/kube-controller-manager changed: Degraded message changed from "NodeControllerDegraded: All master node(s) are ready" to "NodeControllerDegraded: The master node(s) \"master-1.ci-op-6s5tcgwg-a4af7.origin-ci-int-aws.dev.rhcloud.com\" not ready"\nE1105 14:44:13.372719       1 event.go:247] Could not construct reference to: '&v1.ConfigMap{TypeMeta:v1.TypeMeta{Kind:"", APIVersion:""}, ObjectMeta:v1.ObjectMeta{Name:"", GenerateName:"", Namespace:"", SelfLink:"", UID:"", ResourceVersion:"", Generation:0, CreationTimestamp:v1.Time{Time:time.Time{wall:0x0, ext:0, loc:(*time.Location)(nil)}}, DeletionTimestamp:(*v1.Time)(nil), DeletionGracePeriodSeconds:(*int64)(nil), Labels:map[string]string(nil), Annotations:map[string]string(nil), OwnerReferences:[]v1.OwnerReference(nil), Initializers:(*v1.Initializers)(nil), Finalizers:[]string(nil), ClusterName:"", ManagedFields:[]v1.ManagedFieldsEntry(nil)}, Data:map[string]string(nil), BinaryData:map[string][]uint8(nil)}' due to: 'selfLink was empty, can't make reference'. Will not report event: 'Normal' 'LeaderElection' '314a2078-ffc6-11e9-a9ab-0a580a830002 stopped leading'\nI1105 14:44:13.372755       1 leaderelection.go:263] failed to renew lease openshift-kube-controller-manager-operator/kube-controller-manager-operator-lock: failed to tryAcquireOrRenew context deadline exceeded\nF1105 14:44:13.372778       1 leaderelection.go:66] leaderelection lost\n
Nov 05 14:44:14.015 E ns/openshift-apiserver-operator pod/openshift-apiserver-operator-8648f949b6-wb5sx node/master-2.ci-op-6s5tcgwg-a4af7.origin-ci-int-aws.dev.rhcloud.com container=openshift-apiserver-operator container exited with code 255 (Error): s/factory.go:133: watch of *v1.ConfigMap ended with: too old resource version: 56863 (59145)\nW1105 14:35:47.945315       1 reflector.go:289] k8s.io/client-go/informers/factory.go:133: watch of *v1.ConfigMap ended with: too old resource version: 57780 (59237)\nW1105 14:37:19.716475       1 reflector.go:289] k8s.io/client-go/informers/factory.go:133: watch of *v1.ServiceAccount ended with: too old resource version: 56805 (57092)\nW1105 14:39:03.752864       1 reflector.go:289] k8s.io/client-go/informers/factory.go:133: watch of *v1.Secret ended with: too old resource version: 57358 (57505)\nW1105 14:41:27.966215       1 reflector.go:289] k8s.io/client-go/informers/factory.go:133: watch of *v1.Secret ended with: too old resource version: 57358 (57877)\nW1105 14:42:13.772046       1 reflector.go:289] k8s.io/client-go/informers/factory.go:133: watch of *v1.Secret ended with: too old resource version: 57508 (57987)\nW1105 14:42:23.744413       1 reflector.go:289] k8s.io/client-go/informers/factory.go:133: watch of *v1.ConfigMap ended with: too old resource version: 58753 (61118)\nW1105 14:43:31.948977       1 reflector.go:289] k8s.io/client-go/informers/factory.go:133: watch of *v1.ConfigMap ended with: too old resource version: 59395 (62365)\nW1105 14:43:54.739599       1 reflector.go:289] k8s.io/client-go/informers/factory.go:133: watch of *v1.ConfigMap ended with: too old resource version: 59310 (62615)\nI1105 14:44:13.910430       1 leaderelection.go:263] failed to renew lease openshift-apiserver-operator/openshift-apiserver-operator-lock: failed to tryAcquireOrRenew context deadline exceeded\nI1105 14:44:13.910527       1 event.go:209] Event(v1.ObjectReference{Kind:"ConfigMap", Namespace:"openshift-apiserver-operator", Name:"openshift-apiserver-operator-lock", UID:"fe087a84-ffc5-11e9-a984-ac1f6b9985f4", APIVersion:"v1", ResourceVersion:"63019", FieldPath:""}): type: 'Normal' reason: 'LeaderElection' 3172fe72-ffc6-11e9-bad1-0a580a830004 stopped leading\nF1105 14:44:13.910539       1 leaderelection.go:66] leaderelection lost\n
Nov 05 14:44:15.028 E ns/openshift-controller-manager-operator pod/openshift-controller-manager-operator-5446f4b864-npjxm node/master-2.ci-op-6s5tcgwg-a4af7.origin-ci-int-aws.dev.rhcloud.com container=operator container exited with code 255 (Error): rics: (3.721112ms) 200 [Prometheus/2.11.2 10.130.0.15:40228]\nI1105 14:42:21.112487       1 reflector.go:235] k8s.io/client-go/informers/factory.go:133: forcing resync\nI1105 14:42:23.514928       1 wrap.go:47] GET /metrics: (3.911121ms) 200 [Prometheus/2.11.2 10.129.2.11:49668]\nI1105 14:42:29.888312       1 reflector.go:370] github.com/openshift/client-go/config/informers/externalversions/factory.go:101: Watch close - *v1.ClusterOperator total 11 items received\nI1105 14:42:38.596168       1 wrap.go:47] GET /metrics: (3.591125ms) 200 [Prometheus/2.11.2 10.130.0.15:40228]\nI1105 14:42:53.514344       1 wrap.go:47] GET /metrics: (3.365868ms) 200 [Prometheus/2.11.2 10.129.2.11:49668]\nI1105 14:43:08.595843       1 wrap.go:47] GET /metrics: (4.191388ms) 200 [Prometheus/2.11.2 10.130.0.15:40228]\nI1105 14:43:23.514692       1 wrap.go:47] GET /metrics: (3.65144ms) 200 [Prometheus/2.11.2 10.129.2.11:49668]\nI1105 14:43:38.595440       1 wrap.go:47] GET /metrics: (3.872399ms) 200 [Prometheus/2.11.2 10.130.0.15:40228]\nI1105 14:43:40.622353       1 reflector.go:370] k8s.io/client-go/informers/factory.go:133: Watch close - *v1.Service total 0 items received\nI1105 14:43:53.514956       1 wrap.go:47] GET /metrics: (3.575755ms) 200 [Prometheus/2.11.2 10.129.2.11:49668]\nI1105 14:44:08.595860       1 wrap.go:47] GET /metrics: (4.258189ms) 200 [Prometheus/2.11.2 10.130.0.15:40228]\nI1105 14:44:14.178345       1 leaderelection.go:263] failed to renew lease openshift-controller-manager-operator/openshift-controller-manager-operator-lock: failed to tryAcquireOrRenew context deadline exceeded\nF1105 14:44:14.178364       1 leaderelection.go:66] leaderelection lost\nI1105 14:44:14.179327       1 event.go:209] Event(v1.ObjectReference{Kind:"ConfigMap", Namespace:"openshift-controller-manager-operator", Name:"openshift-controller-manager-operator-lock", UID:"ff3b81c0-ffc5-11e9-a984-ac1f6b9985f4", APIVersion:"v1", ResourceVersion:"63023", FieldPath:""}): type: 'Normal' reason: 'LeaderElection' 2e54ff6c-ffc6-11e9-93b1-0a580a83000b stopped leading\n
Nov 05 14:44:19.015 E ns/openshift-service-catalog-apiserver-operator pod/openshift-service-catalog-apiserver-operator-669f4f479-hlbkc node/master-2.ci-op-6s5tcgwg-a4af7.origin-ci-int-aws.dev.rhcloud.com container=operator container exited with code 255 (Error): : 60000 (61810)\nI1105 14:43:04.738721       1 reflector.go:161] Listing and watching *v1.ConfigMap from k8s.io/client-go/informers/factory.go:133\nI1105 14:43:12.666721       1 leaderelection.go:258] successfully renewed lease openshift-service-catalog-apiserver-operator/openshift-cluster-svcat-apiserver-operator-lock\nI1105 14:43:23.005146       1 leaderelection.go:258] successfully renewed lease openshift-service-catalog-apiserver-operator/openshift-cluster-svcat-apiserver-operator-lock\nI1105 14:43:29.697706       1 reflector.go:235] k8s.io/client-go/informers/factory.go:133: forcing resync\nI1105 14:43:33.332338       1 leaderelection.go:258] successfully renewed lease openshift-service-catalog-apiserver-operator/openshift-cluster-svcat-apiserver-operator-lock\nI1105 14:44:18.332621       1 leaderelection.go:263] failed to renew lease openshift-service-catalog-apiserver-operator/openshift-cluster-svcat-apiserver-operator-lock: failed to tryAcquireOrRenew context deadline exceeded\nF1105 14:44:18.332647       1 leaderelection.go:66] leaderelection lost\nI1105 14:44:18.336552       1 workload_controller.go:232] Shutting down OpenShiftSvCatAPIServerOperator\nI1105 14:44:18.336603       1 unsupportedconfigoverrides_controller.go:161] Shutting down UnsupportedConfigOverridesController\nI1105 14:44:18.336607       1 status_controller.go:201] Shutting down StatusSyncer-service-catalog-apiserver\nI1105 14:44:18.336605       1 resourcesync_controller.go:227] Shutting down ResourceSyncController\nI1105 14:44:18.336610       1 finalizer_controller.go:140] Shutting down FinalizerController\nI1105 14:44:18.336620       1 event.go:209] Event(v1.ObjectReference{Kind:"ConfigMap", Namespace:"openshift-service-catalog-apiserver-operator", Name:"openshift-cluster-svcat-apiserver-operator-lock", UID:"91f6317c-ffc6-11e9-8392-0cc47ab29fb4", APIVersion:"v1", ResourceVersion:"63098", FieldPath:""}): type: 'Normal' reason: 'LeaderElection' 91d35d3f-ffc6-11e9-8b45-0a580a83001c stopped leading\nF1105 14:44:18.336692       1 builder.go:248] stopped\n
Nov 05 14:44:21.021 E ns/openshift-kube-apiserver-operator pod/kube-apiserver-operator-7689bf584-6fnn6 node/master-2.ci-op-6s5tcgwg-a4af7.origin-ci-int-aws.dev.rhcloud.com container=kube-apiserver-operator container exited with code 255 (Error): igin-ci-int-aws.dev.rhcloud.com\" not ready" to "NodeControllerDegraded: The master node(s) \"master-1.ci-op-6s5tcgwg-a4af7.origin-ci-int-aws.dev.rhcloud.com,master-0.ci-op-6s5tcgwg-a4af7.origin-ci-int-aws.dev.rhcloud.com\" not ready"\nI1105 14:44:18.681546       1 event.go:209] Event(v1.ObjectReference{Kind:"Deployment", Namespace:"openshift-kube-apiserver-operator", Name:"kube-apiserver-operator", UID:"9d201594-ffc5-11e9-a984-ac1f6b9985f4", APIVersion:"apps/v1", ResourceVersion:"", FieldPath:""}): type: 'Normal' reason: 'OperatorStatusChanged' Status for clusteroperator/kube-apiserver changed: Degraded message changed from "NodeControllerDegraded: The master node(s) \"master-1.ci-op-6s5tcgwg-a4af7.origin-ci-int-aws.dev.rhcloud.com,master-0.ci-op-6s5tcgwg-a4af7.origin-ci-int-aws.dev.rhcloud.com\" not ready" to "NodeControllerDegraded: The master node(s) \"master-0.ci-op-6s5tcgwg-a4af7.origin-ci-int-aws.dev.rhcloud.com,master-1.ci-op-6s5tcgwg-a4af7.origin-ci-int-aws.dev.rhcloud.com\" not ready"\nI1105 14:44:19.082741       1 event.go:209] Event(v1.ObjectReference{Kind:"Deployment", Namespace:"openshift-kube-apiserver-operator", Name:"kube-apiserver-operator", UID:"9d201594-ffc5-11e9-a984-ac1f6b9985f4", APIVersion:"apps/v1", ResourceVersion:"", FieldPath:""}): type: 'Normal' reason: 'OperatorStatusChanged' Status for clusteroperator/kube-apiserver changed: Degraded message changed from "NodeControllerDegraded: The master node(s) \"master-0.ci-op-6s5tcgwg-a4af7.origin-ci-int-aws.dev.rhcloud.com,master-1.ci-op-6s5tcgwg-a4af7.origin-ci-int-aws.dev.rhcloud.com\" not ready" to "NodeControllerDegraded: The master node(s) \"master-1.ci-op-6s5tcgwg-a4af7.origin-ci-int-aws.dev.rhcloud.com,master-0.ci-op-6s5tcgwg-a4af7.origin-ci-int-aws.dev.rhcloud.com\" not ready"\nI1105 14:44:20.614504       1 leaderelection.go:263] failed to renew lease openshift-kube-apiserver-operator/kube-apiserver-operator-lock: failed to tryAcquireOrRenew context deadline exceeded\nF1105 14:44:20.614542       1 leaderelection.go:66] leaderelection lost\n
Nov 05 14:44:22.023 E ns/openshift-service-ca pod/configmap-cabundle-injector-7fcb77969b-fpwhw node/master-2.ci-op-6s5tcgwg-a4af7.origin-ci-int-aws.dev.rhcloud.com container=configmap-cabundle-injector-controller container exited with code 255 (Error): 
Nov 05 14:44:45.642 E clusteroperator/monitoring changed Degraded to True: UpdatingAlertmanagerFailed: Failed to rollout the stack. Error: running task Updating Alertmanager failed: reconciling Alertmanager ClusterRoleBinding failed: updating ClusterRoleBinding object failed: Timeout: request did not complete within requested timeout 34s
Nov 05 14:45:15.121 E ns/openshift-apiserver-operator pod/openshift-apiserver-operator-8648f949b6-wb5sx node/master-2.ci-op-6s5tcgwg-a4af7.origin-ci-int-aws.dev.rhcloud.com container=openshift-apiserver-operator container exited with code 255 (Error): I1105 14:44:14.254681       1 cmd.go:160] Using service-serving-cert provided certificates\nI1105 14:44:14.255031       1 observer_polling.go:106] Starting file observer\nF1105 14:45:14.519454       1 cmd.go:92] the server was unable to return a response in the time allotted, but may still be processing the request (get configmaps extension-apiserver-authentication)\n
Nov 05 14:45:22.135 E ns/openshift-kube-apiserver-operator pod/kube-apiserver-operator-7689bf584-6fnn6 node/master-2.ci-op-6s5tcgwg-a4af7.origin-ci-int-aws.dev.rhcloud.com container=kube-apiserver-operator container exited with code 255 (Error): I1105 14:44:21.182793       1 cmd.go:160] Using service-serving-cert provided certificates\nI1105 14:44:21.183174       1 observer_polling.go:106] Starting file observer\nF1105 14:45:21.640581       1 cmd.go:92] the server was unable to return a response in the time allotted, but may still be processing the request (get configmaps extension-apiserver-authentication)\n
Nov 05 14:46:15.181 E clusteroperator/kube-scheduler changed Degraded to True: NodeControllerDegradedMasterNodesReady: NodeControllerDegraded: The master node(s) "master-1.ci-op-6s5tcgwg-a4af7.origin-ci-int-aws.dev.rhcloud.com,master-0.ci-op-6s5tcgwg-a4af7.origin-ci-int-aws.dev.rhcloud.com" not ready
Nov 05 14:46:15.181 E clusteroperator/kube-controller-manager changed Degraded to True: NodeControllerDegradedMasterNodesReady: NodeControllerDegraded: The master node(s) "master-0.ci-op-6s5tcgwg-a4af7.origin-ci-int-aws.dev.rhcloud.com,master-1.ci-op-6s5tcgwg-a4af7.origin-ci-int-aws.dev.rhcloud.com" not ready
Nov 05 14:46:50.554 E clusteroperator/kube-apiserver changed Degraded to True: NodeControllerDegradedMasterNodesReady: NodeControllerDegraded: The master node(s) "master-1.ci-op-6s5tcgwg-a4af7.origin-ci-int-aws.dev.rhcloud.com,master-0.ci-op-6s5tcgwg-a4af7.origin-ci-int-aws.dev.rhcloud.com" not ready
Nov 05 14:47:13.207 E clusteroperator/dns changed Degraded to True: NotAllDNSesAvailable: Not all desired DNS DaemonSets available
Nov 05 14:47:34.370 E ns/openshift-cluster-node-tuning-operator pod/cluster-node-tuning-operator-5cdc97f965-89b8j node/master-2.ci-op-6s5tcgwg-a4af7.origin-ci-int-aws.dev.rhcloud.com container=cluster-node-tuning-operator container exited with code 255 (Error): I1105 14:46:31.836976       1 main.go:27] Go Version: go1.11.13\nI1105 14:46:31.837038       1 main.go:28] Go OS/Arch: linux/amd64\nI1105 14:46:31.837042       1 main.go:29] node-tuning Version: v4.2.4-201911050122-0-g98f06a3-dirty\nI1105 14:46:31.837046       1 main.go:45] Operator namespace: openshift-cluster-node-tuning-operator\nI1105 14:46:31.837280       1 leader.go:46] Trying to become the leader.\nE1105 14:47:33.796435       1 leader.go:91] the server was unable to return a response in the time allotted, but may still be processing the request (get configmaps node-tuning-operator-lock)Unknown error trying to get ConfigMap\nF1105 14:47:33.796448       1 main.go:58] the server was unable to return a response in the time allotted, but may still be processing the request (get configmaps node-tuning-operator-lock)\n
Nov 05 14:53:50.553 E clusterversion/version changed Failing to True: ClusterOperatorDegraded: Cluster operator dns is reporting a failure: Not all desired DNS DaemonSets available
Nov 05 14:54:41.546 E kube-apiserver failed contacting the API: Get https://api.ci-op-6s5tcgwg-a4af7.origin-ci-int-aws.dev.rhcloud.com:6443/apis/config.openshift.io/v1/clusteroperators?resourceVersion=66788&timeout=9m30s&timeoutSeconds=570&watch=true: dial tcp: lookup api.ci-op-6s5tcgwg-a4af7.origin-ci-int-aws.dev.rhcloud.com on 10.142.0.25:53: no such host
Nov 05 14:54:41.547 E kube-apiserver failed contacting the API: Get https://api.ci-op-6s5tcgwg-a4af7.origin-ci-int-aws.dev.rhcloud.com:6443/apis/config.openshift.io/v1/clusterversions?fieldSelector=metadata.name%3Dversion&resourceVersion=66897&timeout=7m34s&timeoutSeconds=454&watch=true: dial tcp: lookup api.ci-op-6s5tcgwg-a4af7.origin-ci-int-aws.dev.rhcloud.com on 10.142.0.25:53: no such host
Nov 05 14:54:41.547 E kube-apiserver failed contacting the API: Get https://api.ci-op-6s5tcgwg-a4af7.origin-ci-int-aws.dev.rhcloud.com:6443/api/v1/pods?resourceVersion=65853&timeout=8m48s&timeoutSeconds=528&watch=true: dial tcp: lookup api.ci-op-6s5tcgwg-a4af7.origin-ci-int-aws.dev.rhcloud.com on 10.142.0.25:53: no such host
Nov 05 14:54:41.864 E kube-apiserver Kube API started failing: Get https://api.ci-op-6s5tcgwg-a4af7.origin-ci-int-aws.dev.rhcloud.com:6443/api/v1/namespaces/kube-system?timeout=3s: dial tcp: lookup api.ci-op-6s5tcgwg-a4af7.origin-ci-int-aws.dev.rhcloud.com on 10.142.0.25:53: no such host
Nov 05 14:54:52.863 - 135s  E kube-apiserver Kube API is not responding to GET requests
Nov 05 14:54:52.863 - 135s  E openshift-apiserver OpenShift API is not responding to GET requests

				
				Click to see stdout/stderrfrom junit_e2e_20191105-145709.xml

Filter through log files


openshift-tests [Feature:Machines][Serial] Managed cluster should grow and decrease when scaling different machineSets simultaneously [Suite:openshift/conformance/serial] 2.10s

go run hack/e2e.go -v -test --test_args='--ginkgo.focus=openshift\-tests\s\[Feature\:Machines\]\[Serial\]\sManaged\scluster\sshould\sgrow\sand\sdecrease\swhen\sscaling\sdifferent\smachineSets\ssimultaneously\s\[Suite\:openshift\/conformance\/serial\]$'
fail [k8s.io/kubernetes/test/e2e/e2e.go:104]: Unexpected error:
    <*url.Error | 0xc003f98390>: {
        Op: "Get",
        URL: "https://api.ci-op-6s5tcgwg-a4af7.origin-ci-int-aws.dev.rhcloud.com:6443/api/v1/nodes?fieldSelector=spec.unschedulable%3Dfalse&resourceVersion=0",
        Err: {
            Op: "dial",
            Net: "tcp",
            Source: nil,
            Addr: nil,
            Err: {
                Err: "no such host",
                Name: "api.ci-op-6s5tcgwg-a4af7.origin-ci-int-aws.dev.rhcloud.com",
                Server: "10.142.0.25:53",
                IsTimeout: false,
                IsTemporary: false,
            },
        },
    }
    Get https://api.ci-op-6s5tcgwg-a4af7.origin-ci-int-aws.dev.rhcloud.com:6443/api/v1/nodes?fieldSelector=spec.unschedulable%3Dfalse&resourceVersion=0: dial tcp: lookup api.ci-op-6s5tcgwg-a4af7.origin-ci-int-aws.dev.rhcloud.com on 10.142.0.25:53: no such host
occurred
				
				Click to see stdout/stderrfrom junit_e2e_20191105-145709.xml

Filter through log files


openshift-tests [Feature:OpenShiftAuthorization][Serial] authorization TestAuthorizationResourceAccessReview should succeed [Suite:openshift/conformance/serial] 3.90s

go run hack/e2e.go -v -test --test_args='--ginkgo.focus=openshift\-tests\s\[Feature\:OpenShiftAuthorization\]\[Serial\]\sauthorization\s\sTestAuthorizationResourceAccessReview\sshould\ssucceed\s\[Suite\:openshift\/conformance\/serial\]$'
fail [k8s.io/kubernetes/test/e2e/e2e.go:104]: Unexpected error:
    <*url.Error | 0xc003751290>: {
        Op: "Get",
        URL: "https://api.ci-op-6s5tcgwg-a4af7.origin-ci-int-aws.dev.rhcloud.com:6443/api/v1/nodes?fieldSelector=spec.unschedulable%3Dfalse&resourceVersion=0",
        Err: {
            Op: "dial",
            Net: "tcp",
            Source: nil,
            Addr: nil,
            Err: {
                Err: "no such host",
                Name: "api.ci-op-6s5tcgwg-a4af7.origin-ci-int-aws.dev.rhcloud.com",
                Server: "10.142.0.25:53",
                IsTimeout: false,
                IsTemporary: false,
            },
        },
    }
    Get https://api.ci-op-6s5tcgwg-a4af7.origin-ci-int-aws.dev.rhcloud.com:6443/api/v1/nodes?fieldSelector=spec.unschedulable%3Dfalse&resourceVersion=0: dial tcp: lookup api.ci-op-6s5tcgwg-a4af7.origin-ci-int-aws.dev.rhcloud.com on 10.142.0.25:53: no such host
occurred
				
				Click to see stdout/stderrfrom junit_e2e_20191105-145709.xml

Filter through log files


openshift-tests [k8s.io] [sig-node] kubelet [k8s.io] [sig-node] Clean up pods on node kubelet should be able to delete 10 pods per node in 1m0s. [Suite:openshift/conformance/serial] [Suite:k8s] [Serial] 3.00s

go run hack/e2e.go -v -test --test_args='--ginkgo.focus=openshift\-tests\s\[k8s\.io\]\s\[sig\-node\]\skubelet\s\[k8s\.io\]\s\[sig\-node\]\sClean\sup\spods\son\snode\skubelet\sshould\sbe\sable\sto\sdelete\s10\spods\sper\snode\sin\s1m0s\.\s\[Suite\:openshift\/conformance\/serial\]\s\[Suite\:k8s\]\s\[Serial\]$'
fail [k8s.io/kubernetes/test/e2e/e2e.go:104]: Unexpected error:
    <*url.Error | 0xc0035ba750>: {
        Op: "Get",
        URL: "https://api.ci-op-6s5tcgwg-a4af7.origin-ci-int-aws.dev.rhcloud.com:6443/api/v1/nodes?fieldSelector=spec.unschedulable%3Dfalse&resourceVersion=0",
        Err: {
            Op: "dial",
            Net: "tcp",
            Source: nil,
            Addr: nil,
            Err: {
                Err: "no such host",
                Name: "api.ci-op-6s5tcgwg-a4af7.origin-ci-int-aws.dev.rhcloud.com",
                Server: "10.142.0.25:53",
                IsTimeout: false,
                IsTemporary: false,
            },
        },
    }
    Get https://api.ci-op-6s5tcgwg-a4af7.origin-ci-int-aws.dev.rhcloud.com:6443/api/v1/nodes?fieldSelector=spec.unschedulable%3Dfalse&resourceVersion=0: dial tcp: lookup api.ci-op-6s5tcgwg-a4af7.origin-ci-int-aws.dev.rhcloud.com on 10.142.0.25:53: no such host
occurred
				
				Click to see stdout/stderrfrom junit_e2e_20191105-145709.xml

Filter through log files


openshift-tests [sig-api-machinery] Namespaces [Serial] should always delete fast (ALL of 100 namespaces in 150 seconds) [Feature:ComprehensiveNamespaceDraining] [Suite:openshift/conformance/serial] [Suite:k8s] 2.00s

go run hack/e2e.go -v -test --test_args='--ginkgo.focus=openshift\-tests\s\[sig\-api\-machinery\]\sNamespaces\s\[Serial\]\sshould\salways\sdelete\sfast\s\(ALL\sof\s100\snamespaces\sin\s150\sseconds\)\s\[Feature\:ComprehensiveNamespaceDraining\]\s\[Suite\:openshift\/conformance\/serial\]\s\[Suite\:k8s\]$'
fail [k8s.io/kubernetes/test/e2e/e2e.go:104]: Unexpected error:
    <*url.Error | 0xc0035d6480>: {
        Op: "Get",
        URL: "https://api.ci-op-6s5tcgwg-a4af7.origin-ci-int-aws.dev.rhcloud.com:6443/api/v1/nodes?fieldSelector=spec.unschedulable%3Dfalse&resourceVersion=0",
        Err: {
            Op: "dial",
            Net: "tcp",
            Source: nil,
            Addr: nil,
            Err: {
                Err: "no such host",
                Name: "api.ci-op-6s5tcgwg-a4af7.origin-ci-int-aws.dev.rhcloud.com",
                Server: "10.142.0.25:53",
                IsTimeout: false,
                IsTemporary: false,
            },
        },
    }
    Get https://api.ci-op-6s5tcgwg-a4af7.origin-ci-int-aws.dev.rhcloud.com:6443/api/v1/nodes?fieldSelector=spec.unschedulable%3Dfalse&resourceVersion=0: dial tcp: lookup api.ci-op-6s5tcgwg-a4af7.origin-ci-int-aws.dev.rhcloud.com on 10.142.0.25:53: no such host
occurred
				
				Click to see stdout/stderrfrom junit_e2e_20191105-145709.xml

Filter through log files


openshift-tests [sig-api-machinery] Namespaces [Serial] should delete fast enough (90 percent of 100 namespaces in 150 seconds) [Suite:openshift/conformance/serial] [Suite:k8s] 10m3s

go run hack/e2e.go -v -test --test_args='--ginkgo.focus=openshift\-tests\s\[sig\-api\-machinery\]\sNamespaces\s\[Serial\]\sshould\sdelete\sfast\senough\s\(90\spercent\sof\s100\snamespaces\sin\s150\sseconds\)\s\[Suite\:openshift\/conformance\/serial\]\s\[Suite\:k8s\]$'
fail [k8s.io/kubernetes/test/e2e/apimachinery/namespace.go:65]: Unexpected error:
    <*errors.errorString | 0xc000295400>: {
        s: "timed out waiting for the condition",
    }
    timed out waiting for the condition
occurred
				
				Click to see stdout/stderrfrom junit_e2e_20191105-145709.xml

Filter through log files


openshift-tests [sig-api-machinery] Namespaces [Serial] should ensure that all pods are removed when a namespace is deleted [Conformance] [Suite:openshift/conformance/serial/minimal] [Suite:k8s] 1.90s

go run hack/e2e.go -v -test --test_args='--ginkgo.focus=openshift\-tests\s\[sig\-api\-machinery\]\sNamespaces\s\[Serial\]\sshould\sensure\sthat\sall\spods\sare\sremoved\swhen\sa\snamespace\sis\sdeleted\s\[Conformance\]\s\[Suite\:openshift\/conformance\/serial\/minimal\]\s\[Suite\:k8s\]$'
fail [k8s.io/kubernetes/test/e2e/e2e.go:104]: Unexpected error:
    <*url.Error | 0xc002fb5140>: {
        Op: "Get",
        URL: "https://api.ci-op-6s5tcgwg-a4af7.origin-ci-int-aws.dev.rhcloud.com:6443/api/v1/nodes?fieldSelector=spec.unschedulable%3Dfalse&resourceVersion=0",
        Err: {
            Op: "dial",
            Net: "tcp",
            Source: nil,
            Addr: nil,
            Err: {
                Err: "no such host",
                Name: "api.ci-op-6s5tcgwg-a4af7.origin-ci-int-aws.dev.rhcloud.com",
                Server: "10.142.0.25:53",
                IsTimeout: false,
                IsTemporary: false,
            },
        },
    }
    Get https://api.ci-op-6s5tcgwg-a4af7.origin-ci-int-aws.dev.rhcloud.com:6443/api/v1/nodes?fieldSelector=spec.unschedulable%3Dfalse&resourceVersion=0: dial tcp: lookup api.ci-op-6s5tcgwg-a4af7.origin-ci-int-aws.dev.rhcloud.com on 10.142.0.25:53: no such host
occurred
				
				Click to see stdout/stderrfrom junit_e2e_20191105-145709.xml

Filter through log files


openshift-tests [sig-apps] Daemon set [Serial] should rollback without unnecessary restarts [Conformance] [Suite:openshift/conformance/serial/minimal] [Suite:k8s] 2.30s

go run hack/e2e.go -v -test --test_args='--ginkgo.focus=openshift\-tests\s\[sig\-apps\]\sDaemon\sset\s\[Serial\]\sshould\srollback\swithout\sunnecessary\srestarts\s\[Conformance\]\s\[Suite\:openshift\/conformance\/serial\/minimal\]\s\[Suite\:k8s\]$'
fail [k8s.io/kubernetes/test/e2e/e2e.go:104]: Unexpected error:
    <*url.Error | 0xc003844540>: {
        Op: "Get",
        URL: "https://api.ci-op-6s5tcgwg-a4af7.origin-ci-int-aws.dev.rhcloud.com:6443/api/v1/nodes?fieldSelector=spec.unschedulable%3Dfalse&resourceVersion=0",
        Err: {
            Op: "dial",
            Net: "tcp",
            Source: nil,
            Addr: nil,
            Err: {
                Err: "no such host",
                Name: "api.ci-op-6s5tcgwg-a4af7.origin-ci-int-aws.dev.rhcloud.com",
                Server: "10.142.0.25:53",
                IsTimeout: false,
                IsTemporary: false,
            },
        },
    }
    Get https://api.ci-op-6s5tcgwg-a4af7.origin-ci-int-aws.dev.rhcloud.com:6443/api/v1/nodes?fieldSelector=spec.unschedulable%3Dfalse&resourceVersion=0: dial tcp: lookup api.ci-op-6s5tcgwg-a4af7.origin-ci-int-aws.dev.rhcloud.com on 10.142.0.25:53: no such host
occurred
				
				Click to see stdout/stderrfrom junit_e2e_20191105-145709.xml

Filter through log files


openshift-tests [sig-cli] Kubectl client [k8s.io] Kubectl taint [Serial] should remove all the taints with the same key off a node [Suite:openshift/conformance/serial] [Suite:k8s] 2.80s

go run hack/e2e.go -v -test --test_args='--ginkgo.focus=openshift\-tests\s\[sig\-cli\]\sKubectl\sclient\s\[k8s\.io\]\sKubectl\staint\s\[Serial\]\sshould\sremove\sall\sthe\staints\swith\sthe\ssame\skey\soff\sa\snode\s\[Suite\:openshift\/conformance\/serial\]\s\[Suite\:k8s\]$'
fail [k8s.io/kubernetes/test/e2e/e2e.go:104]: Unexpected error:
    <*url.Error | 0xc0033a0120>: {
        Op: "Get",
        URL: "https://api.ci-op-6s5tcgwg-a4af7.origin-ci-int-aws.dev.rhcloud.com:6443/api/v1/nodes?fieldSelector=spec.unschedulable%3Dfalse&resourceVersion=0",
        Err: {
            Op: "dial",
            Net: "tcp",
            Source: nil,
            Addr: nil,
            Err: {
                Err: "no such host",
                Name: "api.ci-op-6s5tcgwg-a4af7.origin-ci-int-aws.dev.rhcloud.com",
                Server: "10.142.0.25:53",
                IsTimeout: false,
                IsTemporary: false,
            },
        },
    }
    Get https://api.ci-op-6s5tcgwg-a4af7.origin-ci-int-aws.dev.rhcloud.com:6443/api/v1/nodes?fieldSelector=spec.unschedulable%3Dfalse&resourceVersion=0: dial tcp: lookup api.ci-op-6s5tcgwg-a4af7.origin-ci-int-aws.dev.rhcloud.com on 10.142.0.25:53: no such host
occurred
				
				Click to see stdout/stderrfrom junit_e2e_20191105-145709.xml

Filter through log files


openshift-tests [sig-network] Service endpoints latency should not be very high [Conformance] [Suite:openshift/conformance/serial/minimal] [Suite:k8s] [Serial] 3.20s

go run hack/e2e.go -v -test --test_args='--ginkgo.focus=openshift\-tests\s\[sig\-network\]\sService\sendpoints\slatency\sshould\snot\sbe\svery\shigh\s\s\[Conformance\]\s\[Suite\:openshift\/conformance\/serial\/minimal\]\s\[Suite\:k8s\]\s\[Serial\]$'
fail [k8s.io/kubernetes/test/e2e/e2e.go:104]: Unexpected error:
    <*url.Error | 0xc002500990>: {
        Op: "Get",
        URL: "https://api.ci-op-6s5tcgwg-a4af7.origin-ci-int-aws.dev.rhcloud.com:6443/api/v1/nodes?fieldSelector=spec.unschedulable%3Dfalse&resourceVersion=0",
        Err: {
            Op: "dial",
            Net: "tcp",
            Source: nil,
            Addr: nil,
            Err: {
                Err: "no such host",
                Name: "api.ci-op-6s5tcgwg-a4af7.origin-ci-int-aws.dev.rhcloud.com",
                Server: "10.142.0.25:53",
                IsTimeout: false,
                IsTemporary: false,
            },
        },
    }
    Get https://api.ci-op-6s5tcgwg-a4af7.origin-ci-int-aws.dev.rhcloud.com:6443/api/v1/nodes?fieldSelector=spec.unschedulable%3Dfalse&resourceVersion=0: dial tcp: lookup api.ci-op-6s5tcgwg-a4af7.origin-ci-int-aws.dev.rhcloud.com on 10.142.0.25:53: no such host
occurred
				
				Click to see stdout/stderrfrom junit_e2e_20191105-145709.xml

Filter through log files


openshift-tests [sig-scheduling] NoExecuteTaintManager Multiple Pods [Serial] only evicts pods without tolerations from tainted nodes [Suite:openshift/conformance/serial] [Suite:k8s] 2.30s

go run hack/e2e.go -v -test --test_args='--ginkgo.focus=openshift\-tests\s\[sig\-scheduling\]\sNoExecuteTaintManager\sMultiple\sPods\s\[Serial\]\sonly\sevicts\spods\swithout\stolerations\sfrom\stainted\snodes\s\[Suite\:openshift\/conformance\/serial\]\s\[Suite\:k8s\]$'
fail [k8s.io/kubernetes/test/e2e/e2e.go:104]: Unexpected error:
    <*url.Error | 0xc002fb7140>: {
        Op: "Get",
        URL: "https://api.ci-op-6s5tcgwg-a4af7.origin-ci-int-aws.dev.rhcloud.com:6443/api/v1/nodes?fieldSelector=spec.unschedulable%3Dfalse&resourceVersion=0",
        Err: {
            Op: "dial",
            Net: "tcp",
            Source: nil,
            Addr: nil,
            Err: {
                Err: "no such host",
                Name: "api.ci-op-6s5tcgwg-a4af7.origin-ci-int-aws.dev.rhcloud.com",
                Server: "10.142.0.25:53",
                IsTimeout: false,
                IsTemporary: false,
            },
        },
    }
    Get https://api.ci-op-6s5tcgwg-a4af7.origin-ci-int-aws.dev.rhcloud.com:6443/api/v1/nodes?fieldSelector=spec.unschedulable%3Dfalse&resourceVersion=0: dial tcp: lookup api.ci-op-6s5tcgwg-a4af7.origin-ci-int-aws.dev.rhcloud.com on 10.142.0.25:53: no such host
occurred
				
				Click to see stdout/stderrfrom junit_e2e_20191105-145709.xml

Filter through log files


openshift-tests [sig-scheduling] NoExecuteTaintManager Single Pod [Serial] doesn't evict pod with tolerations from tainted nodes [Suite:openshift/conformance/serial] [Suite:k8s] 1.70s

go run hack/e2e.go -v -test --test_args='--ginkgo.focus=openshift\-tests\s\[sig\-scheduling\]\sNoExecuteTaintManager\sSingle\sPod\s\[Serial\]\sdoesn\'t\sevict\spod\swith\stolerations\sfrom\stainted\snodes\s\[Suite\:openshift\/conformance\/serial\]\s\[Suite\:k8s\]$'
fail [k8s.io/kubernetes/test/e2e/e2e.go:104]: Unexpected error:
    <*url.Error | 0xc002b8b140>: {
        Op: "Get",
        URL: "https://api.ci-op-6s5tcgwg-a4af7.origin-ci-int-aws.dev.rhcloud.com:6443/api/v1/nodes?fieldSelector=spec.unschedulable%3Dfalse&resourceVersion=0",
        Err: {
            Op: "dial",
            Net: "tcp",
            Source: nil,
            Addr: nil,
            Err: {
                Err: "no such host",
                Name: "api.ci-op-6s5tcgwg-a4af7.origin-ci-int-aws.dev.rhcloud.com",
                Server: "10.142.0.25:53",
                IsTimeout: false,
                IsTemporary: false,
            },
        },
    }
    Get https://api.ci-op-6s5tcgwg-a4af7.origin-ci-int-aws.dev.rhcloud.com:6443/api/v1/nodes?fieldSelector=spec.unschedulable%3Dfalse&resourceVersion=0: dial tcp: lookup api.ci-op-6s5tcgwg-a4af7.origin-ci-int-aws.dev.rhcloud.com on 10.142.0.25:53: no such host
occurred
				
				Click to see stdout/stderrfrom junit_e2e_20191105-145709.xml

Filter through log files


openshift-tests [sig-scheduling] NoExecuteTaintManager Single Pod [Serial] eventually evict pod with finite tolerations from tainted nodes [Suite:openshift/conformance/serial] [Suite:k8s] 3.50s

go run hack/e2e.go -v -test --test_args='--ginkgo.focus=openshift\-tests\s\[sig\-scheduling\]\sNoExecuteTaintManager\sSingle\sPod\s\[Serial\]\seventually\sevict\spod\swith\sfinite\stolerations\sfrom\stainted\snodes\s\[Suite\:openshift\/conformance\/serial\]\s\[Suite\:k8s\]$'
fail [k8s.io/kubernetes/test/e2e/e2e.go:104]: Unexpected error:
    <*url.Error | 0xc003ddc3c0>: {
        Op: "Get",
        URL: "https://api.ci-op-6s5tcgwg-a4af7.origin-ci-int-aws.dev.rhcloud.com:6443/api/v1/nodes?fieldSelector=spec.unschedulable%3Dfalse&resourceVersion=0",
        Err: {
            Op: "dial",
            Net: "tcp",
            Source: nil,
            Addr: nil,
            Err: {
                Err: "no such host",
                Name: "api.ci-op-6s5tcgwg-a4af7.origin-ci-int-aws.dev.rhcloud.com",
                Server: "10.142.0.25:53",
                IsTimeout: false,
                IsTemporary: false,
            },
        },
    }
    Get https://api.ci-op-6s5tcgwg-a4af7.origin-ci-int-aws.dev.rhcloud.com:6443/api/v1/nodes?fieldSelector=spec.unschedulable%3Dfalse&resourceVersion=0: dial tcp: lookup api.ci-op-6s5tcgwg-a4af7.origin-ci-int-aws.dev.rhcloud.com on 10.142.0.25:53: no such host
occurred
				
				Click to see stdout/stderrfrom junit_e2e_20191105-145709.xml

Filter through log files


openshift-tests [sig-scheduling] PodPriorityResolution [Serial] validates critical system priorities are created and resolved [Suite:openshift/conformance/serial] [Suite:k8s] 2.60s

go run hack/e2e.go -v -test --test_args='--ginkgo.focus=openshift\-tests\s\[sig\-scheduling\]\sPodPriorityResolution\s\[Serial\]\svalidates\scritical\ssystem\spriorities\sare\screated\sand\sresolved\s\[Suite\:openshift\/conformance\/serial\]\s\[Suite\:k8s\]$'
fail [k8s.io/kubernetes/test/e2e/e2e.go:104]: Unexpected error:
    <*url.Error | 0xc0021fcff0>: {
        Op: "Get",
        URL: "https://api.ci-op-6s5tcgwg-a4af7.origin-ci-int-aws.dev.rhcloud.com:6443/api/v1/nodes?fieldSelector=spec.unschedulable%3Dfalse&resourceVersion=0",
        Err: {
            Op: "dial",
            Net: "tcp",
            Source: nil,
            Addr: nil,
            Err: {
                Err: "no such host",
                Name: "api.ci-op-6s5tcgwg-a4af7.origin-ci-int-aws.dev.rhcloud.com",
                Server: "10.142.0.25:53",
                IsTimeout: false,
                IsTemporary: false,
            },
        },
    }
    Get https://api.ci-op-6s5tcgwg-a4af7.origin-ci-int-aws.dev.rhcloud.com:6443/api/v1/nodes?fieldSelector=spec.unschedulable%3Dfalse&resourceVersion=0: dial tcp: lookup api.ci-op-6s5tcgwg-a4af7.origin-ci-int-aws.dev.rhcloud.com on 10.142.0.25:53: no such host
occurred
				
				Click to see stdout/stderrfrom junit_e2e_20191105-145709.xml

Filter through log files


openshift-tests [sig-scheduling] SchedulerPriorities [Serial] Pod should avoid nodes that have avoidPod annotation [Suite:openshift/conformance/serial] [Suite:k8s] 1.90s

go run hack/e2e.go -v -test --test_args='--ginkgo.focus=openshift\-tests\s\[sig\-scheduling\]\sSchedulerPriorities\s\[Serial\]\sPod\sshould\savoid\snodes\sthat\shave\savoidPod\sannotation\s\[Suite\:openshift\/conformance\/serial\]\s\[Suite\:k8s\]$'
fail [k8s.io/kubernetes/test/e2e/e2e.go:104]: Unexpected error:
    <*url.Error | 0xc0036267b0>: {
        Op: "Get",
        URL: "https://api.ci-op-6s5tcgwg-a4af7.origin-ci-int-aws.dev.rhcloud.com:6443/api/v1/nodes?fieldSelector=spec.unschedulable%3Dfalse&resourceVersion=0",
        Err: {
            Op: "dial",
            Net: "tcp",
            Source: nil,
            Addr: nil,
            Err: {
                Err: "no such host",
                Name: "api.ci-op-6s5tcgwg-a4af7.origin-ci-int-aws.dev.rhcloud.com",
                Server: "10.142.0.25:53",
                IsTimeout: false,
                IsTemporary: false,
            },
        },
    }
    Get https://api.ci-op-6s5tcgwg-a4af7.origin-ci-int-aws.dev.rhcloud.com:6443/api/v1/nodes?fieldSelector=spec.unschedulable%3Dfalse&resourceVersion=0: dial tcp: lookup api.ci-op-6s5tcgwg-a4af7.origin-ci-int-aws.dev.rhcloud.com on 10.142.0.25:53: no such host
occurred
				
				Click to see stdout/stderrfrom junit_e2e_20191105-145709.xml

Filter through log files


openshift-tests [sig-scheduling] SchedulerPriorities [Serial] Pod should be preferably scheduled to nodes pod can tolerate [Suite:openshift/conformance/serial] [Suite:k8s] 2.40s

go run hack/e2e.go -v -test --test_args='--ginkgo.focus=openshift\-tests\s\[sig\-scheduling\]\sSchedulerPriorities\s\[Serial\]\sPod\sshould\sbe\spreferably\sscheduled\sto\snodes\spod\scan\stolerate\s\[Suite\:openshift\/conformance\/serial\]\s\[Suite\:k8s\]$'
fail [k8s.io/kubernetes/test/e2e/e2e.go:104]: Unexpected error:
    <*url.Error | 0xc002d901e0>: {
        Op: "Get",
        URL: "https://api.ci-op-6s5tcgwg-a4af7.origin-ci-int-aws.dev.rhcloud.com:6443/api/v1/nodes?fieldSelector=spec.unschedulable%3Dfalse&resourceVersion=0",
        Err: {
            Op: "dial",
            Net: "tcp",
            Source: nil,
            Addr: nil,
            Err: {
                Err: "no such host",
                Name: "api.ci-op-6s5tcgwg-a4af7.origin-ci-int-aws.dev.rhcloud.com",
                Server: "10.142.0.25:53",
                IsTimeout: false,
                IsTemporary: false,
            },
        },
    }
    Get https://api.ci-op-6s5tcgwg-a4af7.origin-ci-int-aws.dev.rhcloud.com:6443/api/v1/nodes?fieldSelector=spec.unschedulable%3Dfalse&resourceVersion=0: dial tcp: lookup api.ci-op-6s5tcgwg-a4af7.origin-ci-int-aws.dev.rhcloud.com on 10.142.0.25:53: no such host
occurred
				
				Click to see stdout/stderrfrom junit_e2e_20191105-145709.xml

Filter through log files


openshift-tests [sig-storage] CSI Volumes CSI Topology test using GCE PD driver [Serial] should provision zonal PD with immediate volume binding and AllowedTopologies set and mount the volume to a pod [Suite:openshift/conformance/serial] [Suite:k8s] [Skipped:gce] 2.00s

go run hack/e2e.go -v -test --test_args='--ginkgo.focus=openshift\-tests\s\[sig\-storage\]\sCSI\sVolumes\sCSI\sTopology\stest\susing\sGCE\sPD\sdriver\s\[Serial\]\sshould\sprovision\szonal\sPD\swith\simmediate\svolume\sbinding\sand\sAllowedTopologies\sset\sand\smount\sthe\svolume\sto\sa\spod\s\[Suite\:openshift\/conformance\/serial\]\s\[Suite\:k8s\]\s\[Skipped\:gce\]$'
fail [k8s.io/kubernetes/test/e2e/e2e.go:104]: Unexpected error:
    <*url.Error | 0xc003e435f0>: {
        Op: "Get",
        URL: "https://api.ci-op-6s5tcgwg-a4af7.origin-ci-int-aws.dev.rhcloud.com:6443/api/v1/nodes?fieldSelector=spec.unschedulable%3Dfalse&resourceVersion=0",
        Err: {
            Op: "dial",
            Net: "tcp",
            Source: nil,
            Addr: nil,
            Err: {
                Err: "no such host",
                Name: "api.ci-op-6s5tcgwg-a4af7.origin-ci-int-aws.dev.rhcloud.com",
                Server: "10.142.0.25:53",
                IsTimeout: false,
                IsTemporary: false,
            },
        },
    }
    Get https://api.ci-op-6s5tcgwg-a4af7.origin-ci-int-aws.dev.rhcloud.com:6443/api/v1/nodes?fieldSelector=spec.unschedulable%3Dfalse&resourceVersion=0: dial tcp: lookup api.ci-op-6s5tcgwg-a4af7.origin-ci-int-aws.dev.rhcloud.com on 10.142.0.25:53: no such host
occurred
				
				Click to see stdout/stderrfrom junit_e2e_20191105-145709.xml

Filter through log files


openshift-tests [sig-storage] CSI Volumes [Driver: pd.csi.storage.gke.io][Serial] [Testpattern: Dynamic PV (default fs)] provisioning should create and delete block persistent volumes [Suite:openshift/conformance/serial] [Suite:k8s] [Skipped:gce] 2.20s

go run hack/e2e.go -v -test --test_args='--ginkgo.focus=openshift\-tests\s\[sig\-storage\]\sCSI\sVolumes\s\[Driver\:\spd\.csi\.storage\.gke\.io\]\[Serial\]\s\[Testpattern\:\sDynamic\sPV\s\(default\sfs\)\]\sprovisioning\sshould\screate\sand\sdelete\sblock\spersistent\svolumes\s\[Suite\:openshift\/conformance\/serial\]\s\[Suite\:k8s\]\s\[Skipped\:gce\]$'
fail [k8s.io/kubernetes/test/e2e/e2e.go:104]: Unexpected error:
    <*url.Error | 0xc003a9c300>: {
        Op: "Get",
        URL: "https://api.ci-op-6s5tcgwg-a4af7.origin-ci-int-aws.dev.rhcloud.com:6443/api/v1/nodes?fieldSelector=spec.unschedulable%3Dfalse&resourceVersion=0",
        Err: {
            Op: "dial",
            Net: "tcp",
            Source: nil,
            Addr: nil,
            Err: {
                Err: "no such host",
                Name: "api.ci-op-6s5tcgwg-a4af7.origin-ci-int-aws.dev.rhcloud.com",
                Server: "10.142.0.25:53",
                IsTimeout: false,
                IsTemporary: false,
            },
        },
    }
    Get https://api.ci-op-6s5tcgwg-a4af7.origin-ci-int-aws.dev.rhcloud.com:6443/api/v1/nodes?fieldSelector=spec.unschedulable%3Dfalse&resourceVersion=0: dial tcp: lookup api.ci-op-6s5tcgwg-a4af7.origin-ci-int-aws.dev.rhcloud.com on 10.142.0.25:53: no such host
occurred
				
				Click to see stdout/stderrfrom junit_e2e_20191105-145709.xml

Filter through log files


openshift-tests [sig-storage] CSI Volumes [Driver: pd.csi.storage.gke.io][Serial] [Testpattern: Dynamic PV (default fs)] provisioning should provision storage with mount options [Suite:openshift/conformance/serial] [Suite:k8s] [Skipped:gce] 1.90s

go run hack/e2e.go -v -test --test_args='--ginkgo.focus=openshift\-tests\s\[sig\-storage\]\sCSI\sVolumes\s\[Driver\:\spd\.csi\.storage\.gke\.io\]\[Serial\]\s\[Testpattern\:\sDynamic\sPV\s\(default\sfs\)\]\sprovisioning\sshould\sprovision\sstorage\swith\smount\soptions\s\[Suite\:openshift\/conformance\/serial\]\s\[Suite\:k8s\]\s\[Skipped\:gce\]$'
fail [k8s.io/kubernetes/test/e2e/e2e.go:104]: Unexpected error:
    <*url.Error | 0xc00360b170>: {
        Op: "Get",
        URL: "https://api.ci-op-6s5tcgwg-a4af7.origin-ci-int-aws.dev.rhcloud.com:6443/api/v1/nodes?fieldSelector=spec.unschedulable%3Dfalse&resourceVersion=0",
        Err: {
            Op: "dial",
            Net: "tcp",
            Source: nil,
            Addr: nil,
            Err: {
                Err: "no such host",
                Name: "api.ci-op-6s5tcgwg-a4af7.origin-ci-int-aws.dev.rhcloud.com",
                Server: "10.142.0.25:53",
                IsTimeout: false,
                IsTemporary: false,
            },
        },
    }
    Get https://api.ci-op-6s5tcgwg-a4af7.origin-ci-int-aws.dev.rhcloud.com:6443/api/v1/nodes?fieldSelector=spec.unschedulable%3Dfalse&resourceVersion=0: dial tcp: lookup api.ci-op-6s5tcgwg-a4af7.origin-ci-int-aws.dev.rhcloud.com on 10.142.0.25:53: no such host
occurred
				
				Click to see stdout/stderrfrom junit_e2e_20191105-145709.xml

Filter through log files


openshift-tests [sig-storage] CSI Volumes [Driver: pd.csi.storage.gke.io][Serial] [Testpattern: Dynamic PV (default fs)] subPath should support existing directories when readOnly specified in the volumeSource [Suite:openshift/conformance/serial] [Suite:k8s] [Skipped:gce] 2.60s

go run hack/e2e.go -v -test --test_args='--ginkgo.focus=openshift\-tests\s\[sig\-storage\]\sCSI\sVolumes\s\[Driver\:\spd\.csi\.storage\.gke\.io\]\[Serial\]\s\[Testpattern\:\sDynamic\sPV\s\(default\sfs\)\]\ssubPath\sshould\ssupport\sexisting\sdirectories\swhen\sreadOnly\sspecified\sin\sthe\svolumeSource\s\[Suite\:openshift\/conformance\/serial\]\s\[Suite\:k8s\]\s\[Skipped\:gce\]$'
fail [k8s.io/kubernetes/test/e2e/e2e.go:104]: Unexpected error:
    <*url.Error | 0xc003652420>: {
        Op: "Get",
        URL: "https://api.ci-op-6s5tcgwg-a4af7.origin-ci-int-aws.dev.rhcloud.com:6443/api/v1/nodes?fieldSelector=spec.unschedulable%3Dfalse&resourceVersion=0",
        Err: {
            Op: "dial",
            Net: "tcp",
            Source: nil,
            Addr: nil,
            Err: {
                Err: "no such host",
                Name: "api.ci-op-6s5tcgwg-a4af7.origin-ci-int-aws.dev.rhcloud.com",
                Server: "10.142.0.25:53",
                IsTimeout: false,
                IsTemporary: false,
            },
        },
    }
    Get https://api.ci-op-6s5tcgwg-a4af7.origin-ci-int-aws.dev.rhcloud.com:6443/api/v1/nodes?fieldSelector=spec.unschedulable%3Dfalse&resourceVersion=0: dial tcp: lookup api.ci-op-6s5tcgwg-a4af7.origin-ci-int-aws.dev.rhcloud.com on 10.142.0.25:53: no such host
occurred
				
				Click to see stdout/stderrfrom junit_e2e_20191105-145709.xml

Filter through log files


openshift-tests [sig-storage] CSI Volumes [Driver: pd.csi.storage.gke.io][Serial] [Testpattern: Dynamic PV (default fs)] subPath should support existing directory [Suite:openshift/conformance/serial] [Suite:k8s] [Skipped:gce] 2.10s

go run hack/e2e.go -v -test --test_args='--ginkgo.focus=openshift\-tests\s\[sig\-storage\]\sCSI\sVolumes\s\[Driver\:\spd\.csi\.storage\.gke\.io\]\[Serial\]\s\[Testpattern\:\sDynamic\sPV\s\(default\sfs\)\]\ssubPath\sshould\ssupport\sexisting\sdirectory\s\[Suite\:openshift\/conformance\/serial\]\s\[Suite\:k8s\]\s\[Skipped\:gce\]$'
fail [k8s.io/kubernetes/test/e2e/e2e.go:104]: Unexpected error:
    <*url.Error | 0xc003604540>: {
        Op: "Get",
        URL: "https://api.ci-op-6s5tcgwg-a4af7.origin-ci-int-aws.dev.rhcloud.com:6443/api/v1/nodes?fieldSelector=spec.unschedulable%3Dfalse&resourceVersion=0",
        Err: {
            Op: "dial",
            Net: "tcp",
            Source: nil,
            Addr: nil,
            Err: {
                Err: "no such host",
                Name: "api.ci-op-6s5tcgwg-a4af7.origin-ci-int-aws.dev.rhcloud.com",
                Server: "10.142.0.25:53",
                IsTimeout: false,
                IsTemporary: false,
            },
        },
    }
    Get https://api.ci-op-6s5tcgwg-a4af7.origin-ci-int-aws.dev.rhcloud.com:6443/api/v1/nodes?fieldSelector=spec.unschedulable%3Dfalse&resourceVersion=0: dial tcp: lookup api.ci-op-6s5tcgwg-a4af7.origin-ci-int-aws.dev.rhcloud.com on 10.142.0.25:53: no such host
occurred
				
				Click to see stdout/stderrfrom junit_e2e_20191105-145709.xml

Filter through log files


openshift-tests [sig-storage] CSI Volumes [Driver: pd.csi.storage.gke.io][Serial] [Testpattern: Dynamic PV (ext3)] volumes should be mountable [Suite:openshift/conformance/serial] [Suite:k8s] [Skipped:gce] 2.70s

go run hack/e2e.go -v -test --test_args='--ginkgo.focus=openshift\-tests\s\[sig\-storage\]\sCSI\sVolumes\s\[Driver\:\spd\.csi\.storage\.gke\.io\]\[Serial\]\s\[Testpattern\:\sDynamic\sPV\s\(ext3\)\]\svolumes\sshould\sbe\smountable\s\[Suite\:openshift\/conformance\/serial\]\s\[Suite\:k8s\]\s\[Skipped\:gce\]$'
fail [k8s.io/kubernetes/test/e2e/e2e.go:104]: Unexpected error:
    <*url.Error | 0xc0030c2450>: {
        Op: "Get",
        URL: "https://api.ci-op-6s5tcgwg-a4af7.origin-ci-int-aws.dev.rhcloud.com:6443/api/v1/nodes?fieldSelector=spec.unschedulable%3Dfalse&resourceVersion=0",
        Err: {
            Op: "dial",
            Net: "tcp",
            Source: nil,
            Addr: nil,
            Err: {
                Err: "no such host",
                Name: "api.ci-op-6s5tcgwg-a4af7.origin-ci-int-aws.dev.rhcloud.com",
                Server: "10.142.0.25:53",
                IsTimeout: false,
                IsTemporary: false,
            },
        },
    }
    Get https://api.ci-op-6s5tcgwg-a4af7.origin-ci-int-aws.dev.rhcloud.com:6443/api/v1/nodes?fieldSelector=spec.unschedulable%3Dfalse&resourceVersion=0: dial tcp: lookup api.ci-op-6s5tcgwg-a4af7.origin-ci-int-aws.dev.rhcloud.com on 10.142.0.25:53: no such host
occurred
				
				Click to see stdout/stderrfrom junit_e2e_20191105-145709.xml

Filter through log files


openshift-tests [sig-storage] CSI Volumes [Driver: pd.csi.storage.gke.io][Serial] [Testpattern: Dynamic PV (ntfs)][sig-windows] provisioning should provision storage with mount options [Suite:openshift/conformance/serial] [Suite:k8s] [Skipped:gce] 2.30s

go run hack/e2e.go -v -test --test_args='--ginkgo.focus=openshift\-tests\s\[sig\-storage\]\sCSI\sVolumes\s\[Driver\:\spd\.csi\.storage\.gke\.io\]\[Serial\]\s\[Testpattern\:\sDynamic\sPV\s\(ntfs\)\]\[sig\-windows\]\sprovisioning\sshould\sprovision\sstorage\swith\smount\soptions\s\[Suite\:openshift\/conformance\/serial\]\s\[Suite\:k8s\]\s\[Skipped\:gce\]$'
fail [k8s.io/kubernetes/test/e2e/e2e.go:104]: Unexpected error:
    <*url.Error | 0xc00342c360>: {
        Op: "Get",
        URL: "https://api.ci-op-6s5tcgwg-a4af7.origin-ci-int-aws.dev.rhcloud.com:6443/api/v1/nodes?fieldSelector=spec.unschedulable%3Dfalse&resourceVersion=0",
        Err: {
            Op: "dial",
            Net: "tcp",
            Source: nil,
            Addr: nil,
            Err: {
                Err: "no such host",
                Name: "api.ci-op-6s5tcgwg-a4af7.origin-ci-int-aws.dev.rhcloud.com",
                Server: "10.142.0.25:53",
                IsTimeout: false,
                IsTemporary: false,
            },
        },
    }
    Get https://api.ci-op-6s5tcgwg-a4af7.origin-ci-int-aws.dev.rhcloud.com:6443/api/v1/nodes?fieldSelector=spec.unschedulable%3Dfalse&resourceVersion=0: dial tcp: lookup api.ci-op-6s5tcgwg-a4af7.origin-ci-int-aws.dev.rhcloud.com on 10.142.0.25:53: no such host
occurred
				
				Click to see stdout/stderrfrom junit_e2e_20191105-145709.xml

Filter through log files


openshift-tests [sig-storage] CSI Volumes [Driver: pd.csi.storage.gke.io][Serial] [Testpattern: Inline-volume (default fs)] subPath should support non-existent path [Suite:openshift/conformance/serial] [Suite:k8s] [Skipped:gce] 3.20s

go run hack/e2e.go -v -test --test_args='--ginkgo.focus=openshift\-tests\s\[sig\-storage\]\sCSI\sVolumes\s\[Driver\:\spd\.csi\.storage\.gke\.io\]\[Serial\]\s\[Testpattern\:\sInline\-volume\s\(default\sfs\)\]\ssubPath\sshould\ssupport\snon\-existent\spath\s\[Suite\:openshift\/conformance\/serial\]\s\[Suite\:k8s\]\s\[Skipped\:gce\]$'
fail [k8s.io/kubernetes/test/e2e/e2e.go:104]: Unexpected error:
    <*url.Error | 0xc003f71020>: {
        Op: "Get",
        URL: "https://api.ci-op-6s5tcgwg-a4af7.origin-ci-int-aws.dev.rhcloud.com:6443/api/v1/nodes?fieldSelector=spec.unschedulable%3Dfalse&resourceVersion=0",
        Err: {
            Op: "dial",
            Net: "tcp",
            Source: nil,
            Addr: nil,
            Err: {
                Err: "no such host",
                Name: "api.ci-op-6s5tcgwg-a4af7.origin-ci-int-aws.dev.rhcloud.com",
                Server: "10.142.0.25:53",
                IsTimeout: false,
                IsTemporary: false,
            },
        },
    }
    Get https://api.ci-op-6s5tcgwg-a4af7.origin-ci-int-aws.dev.rhcloud.com:6443/api/v1/nodes?fieldSelector=spec.unschedulable%3Dfalse&resourceVersion=0: dial tcp: lookup api.ci-op-6s5tcgwg-a4af7.origin-ci-int-aws.dev.rhcloud.com on 10.142.0.25:53: no such host
occurred
				
				Click to see stdout/stderrfrom junit_e2e_20191105-145709.xml

Filter through log files


openshift-tests [sig-storage] CSI Volumes [Driver: pd.csi.storage.gke.io][Serial] [Testpattern: Inline-volume (ntfs)][sig-windows] volumes should allow exec of files on the volume [Suite:openshift/conformance/serial] [Suite:k8s] [Skipped:gce] 2.80s

go run hack/e2e.go -v -test --test_args='--ginkgo.focus=openshift\-tests\s\[sig\-storage\]\sCSI\sVolumes\s\[Driver\:\spd\.csi\.storage\.gke\.io\]\[Serial\]\s\[Testpattern\:\sInline\-volume\s\(ntfs\)\]\[sig\-windows\]\svolumes\sshould\sallow\sexec\sof\sfiles\son\sthe\svolume\s\[Suite\:openshift\/conformance\/serial\]\s\[Suite\:k8s\]\s\[Skipped\:gce\]$'
fail [k8s.io/kubernetes/test/e2e/e2e.go:104]: Unexpected error:
    <*url.Error | 0xc004068ff0>: {
        Op: "Get",
        URL: "https://api.ci-op-6s5tcgwg-a4af7.origin-ci-int-aws.dev.rhcloud.com:6443/api/v1/nodes?fieldSelector=spec.unschedulable%3Dfalse&resourceVersion=0",
        Err: {
            Op: "dial",
            Net: "tcp",
            Source: nil,
            Addr: nil,
            Err: {
                Err: "no such host",
                Name: "api.ci-op-6s5tcgwg-a4af7.origin-ci-int-aws.dev.rhcloud.com",
                Server: "10.142.0.25:53",
                IsTimeout: false,
                IsTemporary: false,
            },
        },
    }
    Get https://api.ci-op-6s5tcgwg-a4af7.origin-ci-int-aws.dev.rhcloud.com:6443/api/v1/nodes?fieldSelector=spec.unschedulable%3Dfalse&resourceVersion=0: dial tcp: lookup api.ci-op-6s5tcgwg-a4af7.origin-ci-int-aws.dev.rhcloud.com on 10.142.0.25:53: no such host
occurred
				
				Click to see stdout/stderrfrom junit_e2e_20191105-145709.xml

Filter through log files


openshift-tests [sig-storage] CSI Volumes [Driver: pd.csi.storage.gke.io][Serial] [Testpattern: Inline-volume (xfs)] volumes should allow exec of files on the volume [Suite:openshift/conformance/serial] [Suite:k8s] [Skipped:gce] 2.40s

go run hack/e2e.go -v -test --test_args='--ginkgo.focus=openshift\-tests\s\[sig\-storage\]\sCSI\sVolumes\s\[Driver\:\spd\.csi\.storage\.gke\.io\]\[Serial\]\s\[Testpattern\:\sInline\-volume\s\(xfs\)\]\svolumes\sshould\sallow\sexec\sof\sfiles\son\sthe\svolume\s\[Suite\:openshift\/conformance\/serial\]\s\[Suite\:k8s\]\s\[Skipped\:gce\]$'
fail [k8s.io/kubernetes/test/e2e/e2e.go:104]: Unexpected error:
    <*url.Error | 0xc0039ca420>: {
        Op: "Get",
        URL: "https://api.ci-op-6s5tcgwg-a4af7.origin-ci-int-aws.dev.rhcloud.com:6443/api/v1/nodes?fieldSelector=spec.unschedulable%3Dfalse&resourceVersion=0",
        Err: {
            Op: "dial",
            Net: "tcp",
            Source: nil,
            Addr: nil,
            Err: {
                Err: "no such host",
                Name: "api.ci-op-6s5tcgwg-a4af7.origin-ci-int-aws.dev.rhcloud.com",
                Server: "10.142.0.25:53",
                IsTimeout: false,
                IsTemporary: false,
            },
        },
    }
    Get https://api.ci-op-6s5tcgwg-a4af7.origin-ci-int-aws.dev.rhcloud.com:6443/api/v1/nodes?fieldSelector=spec.unschedulable%3Dfalse&resourceVersion=0: dial tcp: lookup api.ci-op-6s5tcgwg-a4af7.origin-ci-int-aws.dev.rhcloud.com on 10.142.0.25:53: no such host
occurred
				
				Click to see stdout/stderrfrom junit_e2e_20191105-145709.xml

Filter through log files


openshift-tests [sig-storage] CSI Volumes [Driver: pd.csi.storage.gke.io][Serial] [Testpattern: Pre-provisioned PV (default fs)] subPath should be able to unmount after the subpath directory is deleted [Suite:openshift/conformance/serial] [Suite:k8s] [Skipped:gce] 3.10s

go run hack/e2e.go -v -test --test_args='--ginkgo.focus=openshift\-tests\s\[sig\-storage\]\sCSI\sVolumes\s\[Driver\:\spd\.csi\.storage\.gke\.io\]\[Serial\]\s\[Testpattern\:\sPre\-provisioned\sPV\s\(default\sfs\)\]\ssubPath\sshould\sbe\sable\sto\sunmount\safter\sthe\ssubpath\sdirectory\sis\sdeleted\s\[Suite\:openshift\/conformance\/serial\]\s\[Suite\:k8s\]\s\[Skipped\:gce\]$'
fail [k8s.io/kubernetes/test/e2e/e2e.go:104]: Unexpected error:
    <*url.Error | 0xc0031c2210>: {
        Op: "Get",
        URL: "https://api.ci-op-6s5tcgwg-a4af7.origin-ci-int-aws.dev.rhcloud.com:6443/api/v1/nodes?fieldSelector=spec.unschedulable%3Dfalse&resourceVersion=0",
        Err: {
            Op: "dial",
            Net: "tcp",
            Source: nil,
            Addr: nil,
            Err: {
                Err: "no such host",
                Name: "api.ci-op-6s5tcgwg-a4af7.origin-ci-int-aws.dev.rhcloud.com",
                Server: "10.142.0.25:53",
                IsTimeout: false,
                IsTemporary: false,
            },
        },
    }
    Get https://api.ci-op-6s5tcgwg-a4af7.origin-ci-int-aws.dev.rhcloud.com:6443/api/v1/nodes?fieldSelector=spec.unschedulable%3Dfalse&resourceVersion=0: dial tcp: lookup api.ci-op-6s5tcgwg-a4af7.origin-ci-int-aws.dev.rhcloud.com on 10.142.0.25:53: no such host
occurred
				
				Click to see stdout/stderrfrom junit_e2e_20191105-145709.xml

Filter through log files


openshift-tests [sig-storage] CSI Volumes [Driver: pd.csi.storage.gke.io][Serial] [Testpattern: Pre-provisioned PV (default fs)] subPath should support existing directory [Suite:openshift/conformance/serial] [Suite:k8s] [Skipped:gce] 2.20s

go run hack/e2e.go -v -test --test_args='--ginkgo.focus=openshift\-tests\s\[sig\-storage\]\sCSI\sVolumes\s\[Driver\:\spd\.csi\.storage\.gke\.io\]\[Serial\]\s\[Testpattern\:\sPre\-provisioned\sPV\s\(default\sfs\)\]\ssubPath\sshould\ssupport\sexisting\sdirectory\s\[Suite\:openshift\/conformance\/serial\]\s\[Suite\:k8s\]\s\[Skipped\:gce\]$'
fail [k8s.io/kubernetes/test/e2e/e2e.go:104]: Unexpected error:
    <*url.Error | 0xc002da4000>: {
        Op: "Get",
        URL: "https://api.ci-op-6s5tcgwg-a4af7.origin-ci-int-aws.dev.rhcloud.com:6443/api/v1/nodes?fieldSelector=spec.unschedulable%3Dfalse&resourceVersion=0",
        Err: {
            Op: "dial",
            Net: "tcp",
            Source: nil,
            Addr: nil,
            Err: {
                Err: "no such host",
                Name: "api.ci-op-6s5tcgwg-a4af7.origin-ci-int-aws.dev.rhcloud.com",
                Server: "10.142.0.25:53",
                IsTimeout: false,
                IsTemporary: false,
            },
        },
    }
    Get https://api.ci-op-6s5tcgwg-a4af7.origin-ci-int-aws.dev.rhcloud.com:6443/api/v1/nodes?fieldSelector=spec.unschedulable%3Dfalse&resourceVersion=0: dial tcp: lookup api.ci-op-6s5tcgwg-a4af7.origin-ci-int-aws.dev.rhcloud.com on 10.142.0.25:53: no such host
occurred
				
				Click to see stdout/stderrfrom junit_e2e_20191105-145709.xml

Filter through log files


openshift-tests [sig-storage] CSI Volumes [Driver: pd.csi.storage.gke.io][Serial] [Testpattern: Pre-provisioned PV (default fs)] subPath should support file as subpath [Suite:openshift/conformance/serial] [Suite:k8s] [Skipped:gce] 2.10s

go run hack/e2e.go -v -test --test_args='--ginkgo.focus=openshift\-tests\s\[sig\-storage\]\sCSI\sVolumes\s\[Driver\:\spd\.csi\.storage\.gke\.io\]\[Serial\]\s\[Testpattern\:\sPre\-provisioned\sPV\s\(default\sfs\)\]\ssubPath\sshould\ssupport\sfile\sas\ssubpath\s\[Suite\:openshift\/conformance\/serial\]\s\[Suite\:k8s\]\s\[Skipped\:gce\]$'
fail [k8s.io/kubernetes/test/e2e/e2e.go:104]: Unexpected error:
    <*url.Error | 0xc0034d84b0>: {
        Op: "Get",
        URL: "https://api.ci-op-6s5tcgwg-a4af7.origin-ci-int-aws.dev.rhcloud.com:6443/api/v1/nodes?fieldSelector=spec.unschedulable%3Dfalse&resourceVersion=0",
        Err: {
            Op: "dial",
            Net: "tcp",
            Source: nil,
            Addr: nil,
            Err: {
                Err: "no such host",
                Name: "api.ci-op-6s5tcgwg-a4af7.origin-ci-int-aws.dev.rhcloud.com",
                Server: "10.142.0.25:53",
                IsTimeout: false,
                IsTemporary: false,
            },
        },
    }
    Get https://api.ci-op-6s5tcgwg-a4af7.origin-ci-int-aws.dev.rhcloud.com:6443/api/v1/nodes?fieldSelector=spec.unschedulable%3Dfalse&resourceVersion=0: dial tcp: lookup api.ci-op-6s5tcgwg-a4af7.origin-ci-int-aws.dev.rhcloud.com on 10.142.0.25:53: no such host
occurred
				
				Click to see stdout/stderrfrom junit_e2e_20191105-145709.xml

Filter through log files


openshift-tests [sig-storage] CSI Volumes [Driver: pd.csi.storage.gke.io][Serial] [Testpattern: Pre-provisioned PV (ntfs)][sig-windows] volumes should be mountable [Suite:openshift/conformance/serial] [Suite:k8s] [Skipped:gce] 2.50s

go run hack/e2e.go -v -test --test_args='--ginkgo.focus=openshift\-tests\s\[sig\-storage\]\sCSI\sVolumes\s\[Driver\:\spd\.csi\.storage\.gke\.io\]\[Serial\]\s\[Testpattern\:\sPre\-provisioned\sPV\s\(ntfs\)\]\[sig\-windows\]\svolumes\sshould\sbe\smountable\s\[Suite\:openshift\/conformance\/serial\]\s\[Suite\:k8s\]\s\[Skipped\:gce\]$'
fail [k8s.io/kubernetes/test/e2e/e2e.go:104]: Unexpected error:
    <*url.Error | 0xc003f64030>: {
        Op: "Get",
        URL: "https://api.ci-op-6s5tcgwg-a4af7.origin-ci-int-aws.dev.rhcloud.com:6443/api/v1/nodes?fieldSelector=spec.unschedulable%3Dfalse&resourceVersion=0",
        Err: {
            Op: "dial",
            Net: "tcp",
            Source: nil,
            Addr: nil,
            Err: {
                Err: "no such host",
                Name: "api.ci-op-6s5tcgwg-a4af7.origin-ci-int-aws.dev.rhcloud.com",
                Server: "10.142.0.25:53",
                IsTimeout: false,
                IsTemporary: false,
            },
        },
    }
    Get https://api.ci-op-6s5tcgwg-a4af7.origin-ci-int-aws.dev.rhcloud.com:6443/api/v1/nodes?fieldSelector=spec.unschedulable%3Dfalse&resourceVersion=0: dial tcp: lookup api.ci-op-6s5tcgwg-a4af7.origin-ci-int-aws.dev.rhcloud.com on 10.142.0.25:53: no such host
occurred
				
				Click to see stdout/stderrfrom junit_e2e_20191105-145709.xml

Filter through log files


openshift-tests [sig-storage] CSI Volumes [Driver: pd.csi.storage.gke.io][Serial] [Testpattern: Pre-provisioned PV (xfs)] volumes should allow exec of files on the volume [Suite:openshift/conformance/serial] [Suite:k8s] [Skipped:gce] 2.40s

go run hack/e2e.go -v -test --test_args='--ginkgo.focus=openshift\-tests\s\[sig\-storage\]\sCSI\sVolumes\s\[Driver\:\spd\.csi\.storage\.gke\.io\]\[Serial\]\s\[Testpattern\:\sPre\-provisioned\sPV\s\(xfs\)\]\svolumes\sshould\sallow\sexec\sof\sfiles\son\sthe\svolume\s\[Suite\:openshift\/conformance\/serial\]\s\[Suite\:k8s\]\s\[Skipped\:gce\]$'
fail [k8s.io/kubernetes/test/e2e/e2e.go:104]: Unexpected error:
    <*url.Error | 0xc0030d64b0>: {
        Op: "Get",
        URL: "https://api.ci-op-6s5tcgwg-a4af7.origin-ci-int-aws.dev.rhcloud.com:6443/api/v1/nodes?fieldSelector=spec.unschedulable%3Dfalse&resourceVersion=0",
        Err: {
            Op: "dial",
            Net: "tcp",
            Source: nil,
            Addr: nil,
            Err: {
                Err: "no such host",
                Name: "api.ci-op-6s5tcgwg-a4af7.origin-ci-int-aws.dev.rhcloud.com",
                Server: "10.142.0.25:53",
                IsTimeout: false,
                IsTemporary: false,
            },
        },
    }
    Get https://api.ci-op-6s5tcgwg-a4af7.origin-ci-int-aws.dev.rhcloud.com:6443/api/v1/nodes?fieldSelector=spec.unschedulable%3Dfalse&resourceVersion=0: dial tcp: lookup api.ci-op-6s5tcgwg-a4af7.origin-ci-int-aws.dev.rhcloud.com on 10.142.0.25:53: no such host
occurred
				
				Click to see stdout/stderrfrom junit_e2e_20191105-145709.xml

Filter through log files


openshift-tests [sig-storage] EmptyDir wrapper volumes should not cause race condition when used for configmaps [Serial] [Conformance] [Suite:openshift/conformance/serial/minimal] [Suite:k8s] 2.10s

go run hack/e2e.go -v -test --test_args='--ginkgo.focus=openshift\-tests\s\[sig\-storage\]\sEmptyDir\swrapper\svolumes\sshould\snot\scause\srace\scondition\swhen\sused\sfor\sconfigmaps\s\[Serial\]\s\[Conformance\]\s\[Suite\:openshift\/conformance\/serial\/minimal\]\s\[Suite\:k8s\]$'
fail [k8s.io/kubernetes/test/e2e/e2e.go:104]: Unexpected error:
    <*url.Error | 0xc0034a8e70>: {
        Op: "Get",
        URL: "https://api.ci-op-6s5tcgwg-a4af7.origin-ci-int-aws.dev.rhcloud.com:6443/api/v1/nodes?fieldSelector=spec.unschedulable%3Dfalse&resourceVersion=0",
        Err: {
            Op: "dial",
            Net: "tcp",
            Source: nil,
            Addr: nil,
            Err: {
                Err: "no such host",
                Name: "api.ci-op-6s5tcgwg-a4af7.origin-ci-int-aws.dev.rhcloud.com",
                Server: "10.142.0.25:53",
                IsTimeout: false,
                IsTemporary: false,
            },
        },
    }
    Get https://api.ci-op-6s5tcgwg-a4af7.origin-ci-int-aws.dev.rhcloud.com:6443/api/v1/nodes?fieldSelector=spec.unschedulable%3Dfalse&resourceVersion=0: dial tcp: lookup api.ci-op-6s5tcgwg-a4af7.origin-ci-int-aws.dev.rhcloud.com on 10.142.0.25:53: no such host
occurred
				
				Click to see stdout/stderrfrom junit_e2e_20191105-145709.xml

Filter through log files


openshift-tests [sig-storage] In-tree Volumes [Driver: local][LocalVolumeType: gce-localssd-scsi-fs] [Serial] [Testpattern: Dynamic PV (default fs)] provisioning should provision storage with defaults [Suite:openshift/conformance/serial] [Suite:k8s] [Skipped:gce] 2.00s

go run hack/e2e.go -v -test --test_args='--ginkgo.focus=openshift\-tests\s\[sig\-storage\]\sIn\-tree\sVolumes\s\[Driver\:\slocal\]\[LocalVolumeType\:\sgce\-localssd\-scsi\-fs\]\s\[Serial\]\s\[Testpattern\:\sDynamic\sPV\s\(default\sfs\)\]\sprovisioning\sshould\sprovision\sstorage\swith\sdefaults\s\[Suite\:openshift\/conformance\/serial\]\s\[Suite\:k8s\]\s\[Skipped\:gce\]$'
fail [k8s.io/kubernetes/test/e2e/e2e.go:104]: Unexpected error:
    <*url.Error | 0xc003c4be90>: {
        Op: "Get",
        URL: "https://api.ci-op-6s5tcgwg-a4af7.origin-ci-int-aws.dev.rhcloud.com:6443/api/v1/nodes?fieldSelector=spec.unschedulable%3Dfalse&resourceVersion=0",
        Err: {
            Op: "dial",
            Net: "tcp",
            Source: nil,
            Addr: nil,
            Err: {
                Err: "no such host",
                Name: "api.ci-op-6s5tcgwg-a4af7.origin-ci-int-aws.dev.rhcloud.com",
                Server: "10.142.0.25:53",
                IsTimeout: false,
                IsTemporary: false,
            },
        },
    }
    Get https://api.ci-op-6s5tcgwg-a4af7.origin-ci-int-aws.dev.rhcloud.com:6443/api/v1/nodes?fieldSelector=spec.unschedulable%3Dfalse&resourceVersion=0: dial tcp: lookup api.ci-op-6s5tcgwg-a4af7.origin-ci-int-aws.dev.rhcloud.com on 10.142.0.25:53: no such host
occurred
				
				Click to see stdout/stderrfrom junit_e2e_20191105-145709.xml

Filter through log files


openshift-tests [sig-storage] In-tree Volumes [Driver: local][LocalVolumeType: gce-localssd-scsi-fs] [Serial] [Testpattern: Dynamic PV (default fs)] subPath should support existing directories when readOnly specified in the volumeSource [Suite:openshift/conformance/serial] [Suite:k8s] [Skipped:gce] 2.70s

go run hack/e2e.go -v -test --test_args='--ginkgo.focus=openshift\-tests\s\[sig\-storage\]\sIn\-tree\sVolumes\s\[Driver\:\slocal\]\[LocalVolumeType\:\sgce\-localssd\-scsi\-fs\]\s\[Serial\]\s\[Testpattern\:\sDynamic\sPV\s\(default\sfs\)\]\ssubPath\sshould\ssupport\sexisting\sdirectories\swhen\sreadOnly\sspecified\sin\sthe\svolumeSource\s\[Suite\:openshift\/conformance\/serial\]\s\[Suite\:k8s\]\s\[Skipped\:gce\]$'
fail [k8s.io/kubernetes/test/e2e/e2e.go:104]: Unexpected error:
    <*url.Error | 0xc003c8a0f0>: {
        Op: "Get",
        URL: "https://api.ci-op-6s5tcgwg-a4af7.origin-ci-int-aws.dev.rhcloud.com:6443/api/v1/nodes?fieldSelector=spec.unschedulable%3Dfalse&resourceVersion=0",
        Err: {
            Op: "dial",
            Net: "tcp",
            Source: nil,
            Addr: nil,
            Err: {
                Err: "no such host",
                Name: "api.ci-op-6s5tcgwg-a4af7.origin-ci-int-aws.dev.rhcloud.com",
                Server: "10.142.0.25:53",
                IsTimeout: false,
                IsTemporary: false,
            },
        },
    }
    Get https://api.ci-op-6s5tcgwg-a4af7.origin-ci-int-aws.dev.rhcloud.com:6443/api/v1/nodes?fieldSelector=spec.unschedulable%3Dfalse&resourceVersion=0: dial tcp: lookup api.ci-op-6s5tcgwg-a4af7.origin-ci-int-aws.dev.rhcloud.com on 10.142.0.25:53: no such host
occurred
				
				Click to see stdout/stderrfrom junit_e2e_20191105-145709.xml

Filter through log files


openshift-tests [sig-storage] In-tree Volumes [Driver: local][LocalVolumeType: gce-localssd-scsi-fs] [Serial] [Testpattern: Dynamic PV (default fs)] subPath should support non-existent path [Suite:openshift/conformance/serial] [Suite:k8s] [Skipped:gce] 1.90s

go run hack/e2e.go -v -test --test_args='--ginkgo.focus=openshift\-tests\s\[sig\-storage\]\sIn\-tree\sVolumes\s\[Driver\:\slocal\]\[LocalVolumeType\:\sgce\-localssd\-scsi\-fs\]\s\[Serial\]\s\[Testpattern\:\sDynamic\sPV\s\(default\sfs\)\]\ssubPath\sshould\ssupport\snon\-existent\spath\s\[Suite\:openshift\/conformance\/serial\]\s\[Suite\:k8s\]\s\[Skipped\:gce\]$'
fail [k8s.io/kubernetes/test/e2e/e2e.go:104]: Unexpected error:
    <*url.Error | 0xc003476a80>: {
        Op: "Get",
        URL: "https://api.ci-op-6s5tcgwg-a4af7.origin-ci-int-aws.dev.rhcloud.com:6443/api/v1/nodes?fieldSelector=spec.unschedulable%3Dfalse&resourceVersion=0",
        Err: {
            Op: "dial",
            Net: "tcp",
            Source: nil,
            Addr: nil,
            Err: {
                Err: "no such host",
                Name: "api.ci-op-6s5tcgwg-a4af7.origin-ci-int-aws.dev.rhcloud.com",
                Server: "10.142.0.25:53",
                IsTimeout: false,
                IsTemporary: false,
            },
        },
    }
    Get https://api.ci-op-6s5tcgwg-a4af7.origin-ci-int-aws.dev.rhcloud.com:6443/api/v1/nodes?fieldSelector=spec.unschedulable%3Dfalse&resourceVersion=0: dial tcp: lookup api.ci-op-6s5tcgwg-a4af7.origin-ci-int-aws.dev.rhcloud.com on 10.142.0.25:53: no such host
occurred
				
				Click to see stdout/stderrfrom junit_e2e_20191105-145709.xml

Filter through log files


openshift-tests [sig-storage] In-tree Volumes [Driver: local][LocalVolumeType: gce-localssd-scsi-fs] [Serial] [Testpattern: Dynamic PV (filesystem volmode)] volumeMode should create sc, pod, pv, and pvc, read/write to the pv, and delete all created resources [Suite:openshift/conformance/serial] [Suite:k8s] [Skipped:gce] 2.00s

go run hack/e2e.go -v -test --test_args='--ginkgo.focus=openshift\-tests\s\[sig\-storage\]\sIn\-tree\sVolumes\s\[Driver\:\slocal\]\[LocalVolumeType\:\sgce\-localssd\-scsi\-fs\]\s\[Serial\]\s\[Testpattern\:\sDynamic\sPV\s\(filesystem\svolmode\)\]\svolumeMode\sshould\screate\ssc\,\spod\,\spv\,\sand\spvc\,\sread\/write\sto\sthe\spv\,\sand\sdelete\sall\screated\sresources\s\[Suite\:openshift\/conformance\/serial\]\s\[Suite\:k8s\]\s\[Skipped\:gce\]$'
fail [k8s.io/kubernetes/test/e2e/e2e.go:104]: Unexpected error:
    <*url.Error | 0xc002b55140>: {
        Op: "Get",
        URL: "https://api.ci-op-6s5tcgwg-a4af7.origin-ci-int-aws.dev.rhcloud.com:6443/api/v1/nodes?fieldSelector=spec.unschedulable%3Dfalse&resourceVersion=0",
        Err: {
            Op: "dial",
            Net: "tcp",
            Source: nil,
            Addr: nil,
            Err: {
                Err: "no such host",
                Name: "api.ci-op-6s5tcgwg-a4af7.origin-ci-int-aws.dev.rhcloud.com",
                Server: "10.142.0.25:53",
                IsTimeout: false,
                IsTemporary: false,
            },
        },
    }
    Get https://api.ci-op-6s5tcgwg-a4af7.origin-ci-int-aws.dev.rhcloud.com:6443/api/v1/nodes?fieldSelector=spec.unschedulable%3Dfalse&resourceVersion=0: dial tcp: lookup api.ci-op-6s5tcgwg-a4af7.origin-ci-int-aws.dev.rhcloud.com on 10.142.0.25:53: no such host
occurred
				
				Click to see stdout/stderrfrom junit_e2e_20191105-145709.xml

Filter through log files


openshift-tests [sig-storage] In-tree Volumes [Driver: local][LocalVolumeType: gce-localssd-scsi-fs] [Serial] [Testpattern: Dynamic PV (ntfs)][sig-windows] provisioning should allow concurrent writes on the same node [Suite:openshift/conformance/serial] [Suite:k8s] [Skipped:gce] 3.30s

go run hack/e2e.go -v -test --test_args='--ginkgo.focus=openshift\-tests\s\[sig\-storage\]\sIn\-tree\sVolumes\s\[Driver\:\slocal\]\[LocalVolumeType\:\sgce\-localssd\-scsi\-fs\]\s\[Serial\]\s\[Testpattern\:\sDynamic\sPV\s\(ntfs\)\]\[sig\-windows\]\sprovisioning\sshould\sallow\sconcurrent\swrites\son\sthe\ssame\snode\s\[Suite\:openshift\/conformance\/serial\]\s\[Suite\:k8s\]\s\[Skipped\:gce\]$'
fail [k8s.io/kubernetes/test/e2e/e2e.go:104]: Unexpected error:
    <*url.Error | 0xc0037f8cc0>: {
        Op: "Get",
        URL: "https://api.ci-op-6s5tcgwg-a4af7.origin-ci-int-aws.dev.rhcloud.com:6443/api/v1/nodes?fieldSelector=spec.unschedulable%3Dfalse&resourceVersion=0",
        Err: {
            Op: "dial",
            Net: "tcp",
            Source: nil,
            Addr: nil,
            Err: {
                Err: "no such host",
                Name: "api.ci-op-6s5tcgwg-a4af7.origin-ci-int-aws.dev.rhcloud.com",
                Server: "10.142.0.25:53",
                IsTimeout: false,
                IsTemporary: false,
            },
        },
    }
    Get https://api.ci-op-6s5tcgwg-a4af7.origin-ci-int-aws.dev.rhcloud.com:6443/api/v1/nodes?fieldSelector=spec.unschedulable%3Dfalse&resourceVersion=0: dial tcp: lookup api.ci-op-6s5tcgwg-a4af7.origin-ci-int-aws.dev.rhcloud.com on 10.142.0.25:53: no such host
occurred
				
				Click to see stdout/stderrfrom junit_e2e_20191105-145709.xml

Filter through log files


openshift-tests [sig-storage] In-tree Volumes [Driver: local][LocalVolumeType: gce-localssd-scsi-fs] [Serial] [Testpattern: Dynamic PV (ntfs)][sig-windows] provisioning should provision storage with mount options [Suite:openshift/conformance/serial] [Suite:k8s] [Skipped:gce] 1.80s

go run hack/e2e.go -v -test --test_args='--ginkgo.focus=openshift\-tests\s\[sig\-storage\]\sIn\-tree\sVolumes\s\[Driver\:\slocal\]\[LocalVolumeType\:\sgce\-localssd\-scsi\-fs\]\s\[Serial\]\s\[Testpattern\:\sDynamic\sPV\s\(ntfs\)\]\[sig\-windows\]\sprovisioning\sshould\sprovision\sstorage\swith\smount\soptions\s\[Suite\:openshift\/conformance\/serial\]\s\[Suite\:k8s\]\s\[Skipped\:gce\]$'
fail [k8s.io/kubernetes/test/e2e/e2e.go:104]: Unexpected error:
    <*url.Error | 0xc00357e7b0>: {
        Op: "Get",
        URL: "https://api.ci-op-6s5tcgwg-a4af7.origin-ci-int-aws.dev.rhcloud.com:6443/api/v1/nodes?fieldSelector=spec.unschedulable%3Dfalse&resourceVersion=0",
        Err: {
            Op: "dial",
            Net: "tcp",
            Source: nil,
            Addr: nil,
            Err: {
                Err: "no such host",
                Name: "api.ci-op-6s5tcgwg-a4af7.origin-ci-int-aws.dev.rhcloud.com",
                Server: "10.142.0.25:53",
                IsTimeout: false,
                IsTemporary: false,
            },
        },
    }
    Get https://api.ci-op-6s5tcgwg-a4af7.origin-ci-int-aws.dev.rhcloud.com:6443/api/v1/nodes?fieldSelector=spec.unschedulable%3Dfalse&resourceVersion=0: dial tcp: lookup api.ci-op-6s5tcgwg-a4af7.origin-ci-int-aws.dev.rhcloud.com on 10.142.0.25:53: no such host
occurred
				
				Click to see stdout/stderrfrom junit_e2e_20191105-145709.xml

Filter through log files


openshift-tests [sig-storage] In-tree Volumes [Driver: local][LocalVolumeType: gce-localssd-scsi-fs] [Serial] [Testpattern: Inline-volume (default fs)] subPath should support readOnly directory specified in the volumeMount [Suite:openshift/conformance/serial] [Suite:k8s] [Skipped:gce] 2.00s

go run hack/e2e.go -v -test --test_args='--ginkgo.focus=openshift\-tests\s\[sig\-storage\]\sIn\-tree\sVolumes\s\[Driver\:\slocal\]\[LocalVolumeType\:\sgce\-localssd\-scsi\-fs\]\s\[Serial\]\s\[Testpattern\:\sInline\-volume\s\(default\sfs\)\]\ssubPath\sshould\ssupport\sreadOnly\sdirectory\sspecified\sin\sthe\svolumeMount\s\[Suite\:openshift\/conformance\/serial\]\s\[Suite\:k8s\]\s\[Skipped\:gce\]$'
fail [k8s.io/kubernetes/test/e2e/e2e.go:104]: Unexpected error:
    <*url.Error | 0xc003268240>: {
        Op: "Get",
        URL: "https://api.ci-op-6s5tcgwg-a4af7.origin-ci-int-aws.dev.rhcloud.com:6443/api/v1/nodes?fieldSelector=spec.unschedulable%3Dfalse&resourceVersion=0",
        Err: {
            Op: "dial",
            Net: "tcp",
            Source: nil,
            Addr: nil,
            Err: {
                Err: "no such host",
                Name: "api.ci-op-6s5tcgwg-a4af7.origin-ci-int-aws.dev.rhcloud.com",
                Server: "10.142.0.25:53",
                IsTimeout: false,
                IsTemporary: false,
            },
        },
    }
    Get https://api.ci-op-6s5tcgwg-a4af7.origin-ci-int-aws.dev.rhcloud.com:6443/api/v1/nodes?fieldSelector=spec.unschedulable%3Dfalse&resourceVersion=0: dial tcp: lookup api.ci-op-6s5tcgwg-a4af7.origin-ci-int-aws.dev.rhcloud.com on 10.142.0.25:53: no such host
occurred
				
				Click to see stdout/stderrfrom junit_e2e_20191105-145709.xml

Filter through log files


openshift-tests [sig-storage] In-tree Volumes [Driver: local][LocalVolumeType: gce-localssd-scsi-fs] [Serial] [Testpattern: Inline-volume (default fs)] volumes should allow exec of files on the volume [Suite:openshift/conformance/serial] [Suite:k8s] [Skipped:gce] 2.10s

go run hack/e2e.go -v -test --test_args='--ginkgo.focus=openshift\-tests\s\[sig\-storage\]\sIn\-tree\sVolumes\s\[Driver\:\slocal\]\[LocalVolumeType\:\sgce\-localssd\-scsi\-fs\]\s\[Serial\]\s\[Testpattern\:\sInline\-volume\s\(default\sfs\)\]\svolumes\sshould\sallow\sexec\sof\sfiles\son\sthe\svolume\s\[Suite\:openshift\/conformance\/serial\]\s\[Suite\:k8s\]\s\[Skipped\:gce\]$'
fail [k8s.io/kubernetes/test/e2e/e2e.go:104]: Unexpected error:
    <*url.Error | 0xc002e06480>: {
        Op: "Get",
        URL: "https://api.ci-op-6s5tcgwg-a4af7.origin-ci-int-aws.dev.rhcloud.com:6443/api/v1/nodes?fieldSelector=spec.unschedulable%3Dfalse&resourceVersion=0",
        Err: {
            Op: "dial",
            Net: "tcp",
            Source: nil,
            Addr: nil,
            Err: {
                Err: "no such host",
                Name: "api.ci-op-6s5tcgwg-a4af7.origin-ci-int-aws.dev.rhcloud.com",
                Server: "10.142.0.25:53",
                IsTimeout: false,
                IsTemporary: false,
            },
        },
    }
    Get https://api.ci-op-6s5tcgwg-a4af7.origin-ci-int-aws.dev.rhcloud.com:6443/api/v1/nodes?fieldSelector=spec.unschedulable%3Dfalse&resourceVersion=0: dial tcp: lookup api.ci-op-6s5tcgwg-a4af7.origin-ci-int-aws.dev.rhcloud.com on 10.142.0.25:53: no such host
occurred
				
				Click to see stdout/stderrfrom junit_e2e_20191105-145709.xml

Filter through log files


openshift-tests [sig-storage] In-tree Volumes [Driver: local][LocalVolumeType: gce-localssd-scsi-fs] [Serial] [Testpattern: Inline-volume (ext3)] volumes should be mountable [Suite:openshift/conformance/serial] [Suite:k8s] [Skipped:gce] 2.20s

go run hack/e2e.go -v -test --test_args='--ginkgo.focus=openshift\-tests\s\[sig\-storage\]\sIn\-tree\sVolumes\s\[Driver\:\slocal\]\[LocalVolumeType\:\sgce\-localssd\-scsi\-fs\]\s\[Serial\]\s\[Testpattern\:\sInline\-volume\s\(ext3\)\]\svolumes\sshould\sbe\smountable\s\[Suite\:openshift\/conformance\/serial\]\s\[Suite\:k8s\]\s\[Skipped\:gce\]$'
fail [k8s.io/kubernetes/test/e2e/e2e.go:104]: Unexpected error:
    <*url.Error | 0xc003ecd290>: {
        Op: "Get",
        URL: "https://api.ci-op-6s5tcgwg-a4af7.origin-ci-int-aws.dev.rhcloud.com:6443/api/v1/nodes?fieldSelector=spec.unschedulable%3Dfalse&resourceVersion=0",
        Err: {
            Op: "dial",
            Net: "tcp",
            Source: nil,
            Addr: nil,
            Err: {
                Err: "no such host",
                Name: "api.ci-op-6s5tcgwg-a4af7.origin-ci-int-aws.dev.rhcloud.com",
                Server: "10.142.0.25:53",
                IsTimeout: false,
                IsTemporary: false,
            },
        },
    }
    Get https://api.ci-op-6s5tcgwg-a4af7.origin-ci-int-aws.dev.rhcloud.com:6443/api/v1/nodes?fieldSelector=spec.unschedulable%3Dfalse&resourceVersion=0: dial tcp: lookup api.ci-op-6s5tcgwg-a4af7.origin-ci-int-aws.dev.rhcloud.com on 10.142.0.25:53: no such host
occurred
				
				Click to see stdout/stderrfrom junit_e2e_20191105-145709.xml

Filter through log files


openshift-tests [sig-storage] In-tree Volumes [Driver: local][LocalVolumeType: gce-localssd-scsi-fs] [Serial] [Testpattern: Inline-volume (ntfs)][sig-windows] volumes should be mountable [Suite:openshift/conformance/serial] [Suite:k8s] [Skipped:gce] 3.40s

go run hack/e2e.go -v -test --test_args='--ginkgo.focus=openshift\-tests\s\[sig\-storage\]\sIn\-tree\sVolumes\s\[Driver\:\slocal\]\[LocalVolumeType\:\sgce\-localssd\-scsi\-fs\]\s\[Serial\]\s\[Testpattern\:\sInline\-volume\s\(ntfs\)\]\[sig\-windows\]\svolumes\sshould\sbe\smountable\s\[Suite\:openshift\/conformance\/serial\]\s\[Suite\:k8s\]\s\[Skipped\:gce\]$'
fail [k8s.io/kubernetes/test/e2e/e2e.go:104]: Unexpected error:
    <*url.Error | 0xc003664150>: {
        Op: "Get",
        URL: "https://api.ci-op-6s5tcgwg-a4af7.origin-ci-int-aws.dev.rhcloud.com:6443/api/v1/nodes?fieldSelector=spec.unschedulable%3Dfalse&resourceVersion=0",
        Err: {
            Op: "dial",
            Net: "tcp",
            Source: nil,
            Addr: nil,
            Err: {
                Err: "no such host",
                Name: "api.ci-op-6s5tcgwg-a4af7.origin-ci-int-aws.dev.rhcloud.com",
                Server: "10.142.0.25:53",
                IsTimeout: false,
                IsTemporary: false,
            },
        },
    }
    Get https://api.ci-op-6s5tcgwg-a4af7.origin-ci-int-aws.dev.rhcloud.com:6443/api/v1/nodes?fieldSelector=spec.unschedulable%3Dfalse&resourceVersion=0: dial tcp: lookup api.ci-op-6s5tcgwg-a4af7.origin-ci-int-aws.dev.rhcloud.com on 10.142.0.25:53: no such host
occurred
				
				Click to see stdout/stderrfrom junit_e2e_20191105-145709.xml

Filter through log files


openshift-tests [sig-storage] In-tree Volumes [Driver: local][LocalVolumeType: gce-localssd-scsi-fs] [Serial] [Testpattern: Pre-provisioned PV (default fs)] subPath should support existing directories when readOnly specified in the volumeSource [Suite:openshift/conformance/serial] [Suite:k8s] [Skipped:gce] 2.40s

go run hack/e2e.go -v -test --test_args='--ginkgo.focus=openshift\-tests\s\[sig\-storage\]\sIn\-tree\sVolumes\s\[Driver\:\slocal\]\[LocalVolumeType\:\sgce\-localssd\-scsi\-fs\]\s\[Serial\]\s\[Testpattern\:\sPre\-provisioned\sPV\s\(default\sfs\)\]\ssubPath\sshould\ssupport\sexisting\sdirectories\swhen\sreadOnly\sspecified\sin\sthe\svolumeSource\s\[Suite\:openshift\/conformance\/serial\]\s\[Suite\:k8s\]\s\[Skipped\:gce\]$'
fail [k8s.io/kubernetes/test/e2e/e2e.go:104]: Unexpected error:
    <*url.Error | 0xc0032320c0>: {
        Op: "Get",
        URL: "https://api.ci-op-6s5tcgwg-a4af7.origin-ci-int-aws.dev.rhcloud.com:6443/api/v1/nodes?fieldSelector=spec.unschedulable%3Dfalse&resourceVersion=0",
        Err: {
            Op: "dial",
            Net: "tcp",
            Source: nil,
            Addr: nil,
            Err: {
                Err: "no such host",
                Name: "api.ci-op-6s5tcgwg-a4af7.origin-ci-int-aws.dev.rhcloud.com",
                Server: "10.142.0.25:53",
                IsTimeout: false,
                IsTemporary: false,
            },
        },
    }
    Get https://api.ci-op-6s5tcgwg-a4af7.origin-ci-int-aws.dev.rhcloud.com:6443/api/v1/nodes?fieldSelector=spec.unschedulable%3Dfalse&resourceVersion=0: dial tcp: lookup api.ci-op-6s5tcgwg-a4af7.origin-ci-int-aws.dev.rhcloud.com on 10.142.0.25:53: no such host
occurred
				
				Click to see stdout/stderrfrom junit_e2e_20191105-145709.xml

Filter through log files


openshift-tests [sig-storage] In-tree Volumes [Driver: local][LocalVolumeType: gce-localssd-scsi-fs] [Serial] [Testpattern: Pre-provisioned PV (default fs)] subPath should support non-existent path [Suite:openshift/conformance/serial] [Suite:k8s] [Skipped:gce] 2.40s

go run hack/e2e.go -v -test --test_args='--ginkgo.focus=openshift\-tests\s\[sig\-storage\]\sIn\-tree\sVolumes\s\[Driver\:\slocal\]\[LocalVolumeType\:\sgce\-localssd\-scsi\-fs\]\s\[Serial\]\s\[Testpattern\:\sPre\-provisioned\sPV\s\(default\sfs\)\]\ssubPath\sshould\ssupport\snon\-existent\spath\s\[Suite\:openshift\/conformance\/serial\]\s\[Suite\:k8s\]\s\[Skipped\:gce\]$'
fail [k8s.io/kubernetes/test/e2e/e2e.go:104]: Unexpected error:
    <*url.Error | 0xc0033082d0>: {
        Op: "Get",
        URL: "https://api.ci-op-6s5tcgwg-a4af7.origin-ci-int-aws.dev.rhcloud.com:6443/api/v1/nodes?fieldSelector=spec.unschedulable%3Dfalse&resourceVersion=0",
        Err: {
            Op: "dial",
            Net: "tcp",
            Source: nil,
            Addr: nil,
            Err: {
                Err: "no such host",
                Name: "api.ci-op-6s5tcgwg-a4af7.origin-ci-int-aws.dev.rhcloud.com",
                Server: "10.142.0.25:53",
                IsTimeout: false,
                IsTemporary: false,
            },
        },
    }
    Get https://api.ci-op-6s5tcgwg-a4af7.origin-ci-int-aws.dev.rhcloud.com:6443/api/v1/nodes?fieldSelector=spec.unschedulable%3Dfalse&resourceVersion=0: dial tcp: lookup api.ci-op-6s5tcgwg-a4af7.origin-ci-int-aws.dev.rhcloud.com on 10.142.0.25:53: no such host
occurred
				
				Click to see stdout/stderrfrom junit_e2e_20191105-145709.xml

Filter through log files


openshift-tests [sig-storage] In-tree Volumes [Driver: local][LocalVolumeType: gce-localssd-scsi-fs] [Serial] [Testpattern: Pre-provisioned PV (ntfs)][sig-windows] volumes should be mountable [Suite:openshift/conformance/serial] [Suite:k8s] [Skipped:gce] 2.20s

go run hack/e2e.go -v -test --test_args='--ginkgo.focus=openshift\-tests\s\[sig\-storage\]\sIn\-tree\sVolumes\s\[Driver\:\slocal\]\[LocalVolumeType\:\sgce\-localssd\-scsi\-fs\]\s\[Serial\]\s\[Testpattern\:\sPre\-provisioned\sPV\s\(ntfs\)\]\[sig\-windows\]\svolumes\sshould\sbe\smountable\s\[Suite\:openshift\/conformance\/serial\]\s\[Suite\:k8s\]\s\[Skipped\:gce\]$'
fail [k8s.io/kubernetes/test/e2e/e2e.go:104]: Unexpected error:
    <*url.Error | 0xc003540930>: {
        Op: "Get",
        URL: "https://api.ci-op-6s5tcgwg-a4af7.origin-ci-int-aws.dev.rhcloud.com:6443/api/v1/nodes?fieldSelector=spec.unschedulable%3Dfalse&resourceVersion=0",
        Err: {
            Op: "dial",
            Net: "tcp",
            Source: nil,
            Addr: nil,
            Err: {
                Err: "no such host",
                Name: "api.ci-op-6s5tcgwg-a4af7.origin-ci-int-aws.dev.rhcloud.com",
                Server: "10.142.0.25:53",
                IsTimeout: false,
                IsTemporary: false,
            },
        },
    }
    Get https://api.ci-op-6s5tcgwg-a4af7.origin-ci-int-aws.dev.rhcloud.com:6443/api/v1/nodes?fieldSelector=spec.unschedulable%3Dfalse&resourceVersion=0: dial tcp: lookup api.ci-op-6s5tcgwg-a4af7.origin-ci-int-aws.dev.rhcloud.com on 10.142.0.25:53: no such host
occurred
				
				Click to see stdout/stderrfrom junit_e2e_20191105-145709.xml

Filter through log files


openshift-tests [sig-storage] In-tree Volumes [Driver: local][LocalVolumeType: gce-localssd-scsi-fs] [Serial] [Testpattern: Pre-provisioned PV (xfs)] volumes should allow exec of files on the volume [Suite:openshift/conformance/serial] [Suite:k8s] [Skipped:gce] 1.90s

go run hack/e2e.go -v -test --test_args='--ginkgo.focus=openshift\-tests\s\[sig\-storage\]\sIn\-tree\sVolumes\s\[Driver\:\slocal\]\[LocalVolumeType\:\sgce\-localssd\-scsi\-fs\]\s\[Serial\]\s\[Testpattern\:\sPre\-provisioned\sPV\s\(xfs\)\]\svolumes\sshould\sallow\sexec\sof\sfiles\son\sthe\svolume\s\[Suite\:openshift\/conformance\/serial\]\s\[Suite\:k8s\]\s\[Skipped\:gce\]$'
fail [k8s.io/kubernetes/test/e2e/e2e.go:104]: Unexpected error:
    <*url.Error | 0xc00373c480>: {
        Op: "Get",
        URL: "https://api.ci-op-6s5tcgwg-a4af7.origin-ci-int-aws.dev.rhcloud.com:6443/api/v1/nodes?fieldSelector=spec.unschedulable%3Dfalse&resourceVersion=0",
        Err: {
            Op: "dial",
            Net: "tcp",
            Source: nil,
            Addr: nil,
            Err: {
                Err: "no such host",
                Name: "api.ci-op-6s5tcgwg-a4af7.origin-ci-int-aws.dev.rhcloud.com",
                Server: "10.142.0.25:53",
                IsTimeout: false,
                IsTemporary: false,
            },
        },
    }
    Get https://api.ci-op-6s5tcgwg-a4af7.origin-ci-int-aws.dev.rhcloud.com:6443/api/v1/nodes?fieldSelector=spec.unschedulable%3Dfalse&resourceVersion=0: dial tcp: lookup api.ci-op-6s5tcgwg-a4af7.origin-ci-int-aws.dev.rhcloud.com on 10.142.0.25:53: no such host
occurred
				
				Click to see stdout/stderrfrom junit_e2e_20191105-145709.xml

Filter through log files


openshift-tests [sig-storage] PersistentVolumes-local Stress with local volumes [Serial] should be able to process many pods and reuse local volumes [Suite:openshift/conformance/serial] [Suite:k8s] 15m0s

go run hack/e2e.go -v -test --test_args='--ginkgo.focus=openshift\-tests\s\[sig\-storage\]\sPersistentVolumes\-local\s\sStress\swith\slocal\svolumes\s\[Serial\]\sshould\sbe\sable\sto\sprocess\smany\spods\sand\sreuse\slocal\svolumes\s\[Suite\:openshift\/conformance\/serial\]\s\[Suite\:k8s\]$'
Nov  5 14:47:06.700: INFO: At 2019-11-05 14:43:45 +0000 UTC - event for pvc-4q22g: {persistentvolume-controller } WaitForFirstConsumer: waiting for first consumer to be created before binding
Nov  5 14:47:06.700: INFO: At 2019-11-05 14:43:45 +0000 UTC - event for pvc-72vd7: {persistentvolume-controller } WaitForFirstConsumer: waiting for first consumer to be created before binding
Nov  5 14:47:06.700: INFO: At 2019-11-05 14:43:45 +0000 UTC - event for pvc-mw6fc: {persistentvolume-controller } WaitForFirstConsumer: waiting for first consumer to be created before binding
Nov  5 14:47:06.700: INFO: At 2019-11-05 14:43:45 +0000 UTC - event for pvc-n2q4k: {persistentvolume-controller } WaitForFirstConsumer: waiting for first consumer to be created before binding
Nov  5 14:47:06.700: INFO: At 2019-11-05 14:43:45 +0000 UTC - event for pvc-pjzgc: {persistentvolume-controller } WaitForFirstConsumer: waiting for first consumer to be created before binding
Nov  5 14:47:06.700: INFO: At 2019-11-05 14:43:45 +0000 UTC - event for pvc-qw79z: {persistentvolume-controller } WaitForFirstConsumer: waiting for first consumer to be created before binding
Nov  5 14:47:06.700: INFO: At 2019-11-05 14:43:46 +0000 UTC - event for pvc-8fc4c: {persistentvolume-controller } WaitForFirstConsumer: waiting for first consumer to be created before binding
Nov  5 14:47:06.700: INFO: At 2019-11-05 14:43:46 +0000 UTC - event for pvc-d5ws6: {persistentvolume-controller } WaitForFirstConsumer: waiting for first consumer to be created before binding
Nov  5 14:47:06.700: INFO: At 2019-11-05 14:43:46 +0000 UTC - event for pvc-d8fbr: {persistentvolume-controller } WaitForFirstConsumer: waiting for first consumer to be created before binding
Nov  5 14:47:06.700: INFO: At 2019-11-05 14:43:46 +0000 UTC - event for pvc-jm2xj: {persistentvolume-controller } WaitForFirstConsumer: waiting for first consumer to be created before binding
Nov  5 14:47:06.700: INFO: At 2019-11-05 14:43:46 +0000 UTC - event for pvc-jv5s8: {persistentvolume-controller } WaitForFirstConsumer: waiting for first consumer to be created before binding
Nov  5 14:47:06.700: INFO: At 2019-11-05 14:43:46 +0000 UTC - event for pvc-l7kg8: {persistentvolume-controller } WaitForFirstConsumer: waiting for first consumer to be created before binding
Nov  5 14:47:06.700: INFO: At 2019-11-05 14:43:46 +0000 UTC - event for pvc-mxjnm: {persistentvolume-controller } WaitForFirstConsumer: waiting for first consumer to be created before binding
Nov  5 14:47:06.700: INFO: At 2019-11-05 14:43:46 +0000 UTC - event for pvc-nlx7v: {persistentvolume-controller } WaitForFirstConsumer: waiting for first consumer to be created before binding
Nov  5 14:47:06.700: INFO: At 2019-11-05 14:43:46 +0000 UTC - event for pvc-sj52l: {persistentvolume-controller } WaitForFirstConsumer: waiting for first consumer to be created before binding
Nov  5 14:47:06.700: INFO: At 2019-11-05 14:43:46 +0000 UTC - event for pvc-tqkbx: {persistentvolume-controller } WaitForFirstConsumer: waiting for first consumer to be created before binding
Nov  5 14:47:06.700: INFO: At 2019-11-05 14:43:47 +0000 UTC - event for pvc-cpf4m: {persistentvolume-controller } WaitForFirstConsumer: waiting for first consumer to be created before binding
Nov  5 14:47:06.700: INFO: At 2019-11-05 14:43:56 +0000 UTC - event for security-context-a3eebab7-ffda-11e9-95df-0a58ac10d2e8: {default-scheduler } FailedScheduling: 0/6 nodes are available: 3 node(s) didn't find available persistent volumes to bind, 3 node(s) had taints that the pod didn't tolerate.
Nov  5 14:47:06.700: INFO: At 2019-11-05 14:43:56 +0000 UTC - event for security-context-a57f654b-ffda-11e9-95df-0a58ac10d2e8: {default-scheduler } FailedScheduling: 0/6 nodes are available: 3 node(s) didn't find available persistent volumes to bind, 3 node(s) had taints that the pod didn't tolerate.
Nov  5 14:47:06.700: INFO: At 2019-11-05 14:43:56 +0000 UTC - event for security-context-a71974c6-ffda-11e9-95df-0a58ac10d2e8: {default-scheduler } FailedScheduling: 0/6 nodes are available: 3 node(s) didn't find available persistent volumes to bind, 3 node(s) had taints that the pod didn't tolerate.
Nov  5 14:47:06.700: INFO: At 2019-11-05 14:43:56 +0000 UTC - event for security-context-ab9861d9-ffda-11e9-95df-0a58ac10d2e8: {default-scheduler } FailedScheduling: 0/6 nodes are available: 3 node(s) didn't find available persistent volumes to bind, 3 node(s) had taints that the pod didn't tolerate.
Nov  5 14:47:06.700: INFO: At 2019-11-05 14:43:56 +0000 UTC - event for security-context-abc73c2b-ffda-11e9-95df-0a58ac10d2e8: {default-scheduler } FailedScheduling: 0/6 nodes are available: 3 node(s) didn't find available persistent volumes to bind, 3 node(s) had taints that the pod didn't tolerate.
Nov  5 14:47:06.700: INFO: At 2019-11-05 14:43:56 +0000 UTC - event for security-context-abf60015-ffda-11e9-95df-0a58ac10d2e8: {default-scheduler } FailedScheduling: 0/6 nodes are available: 3 node(s) didn't find available persistent volumes to bind, 3 node(s) had taints that the pod didn't tolerate.
Nov  5 14:47:06.700: INFO: At 2019-11-05 14:43:56 +0000 UTC - event for security-context-ac24d9ef-ffda-11e9-95df-0a58ac10d2e8: {default-scheduler } FailedScheduling: 0/6 nodes are available: 3 node(s) didn't find available persistent volumes to bind, 3 node(s) had taints that the pod didn't tolerate.
Nov  5 14:47:06.700: INFO: At 2019-11-05 14:43:56 +0000 UTC - event for security-context-ac53cb90-ffda-11e9-95df-0a58ac10d2e8: {default-scheduler } FailedScheduling: 0/6 nodes are available: 3 node(s) didn't find available persistent volumes to bind, 3 node(s) had taints that the pod didn't tolerate.
Nov  5 14:47:06.700: INFO: At 2019-11-05 14:44:03 +0000 UTC - event for security-context-a4b2eb02-ffda-11e9-95df-0a58ac10d2e8: {kubelet worker-0.ci-op-6s5tcgwg-a4af7.origin-ci-int-aws.dev.rhcloud.com} FailedCreatePodSandBox: Failed create pod sandbox: rpc error: code = Unknown desc = failed to create pod network sandbox k8s_security-context-a4b2eb02-ffda-11e9-95df-0a58ac10d2e8_e2e-persistent-local-volumes-test-9509_a4dc742c-ffda-11e9-b252-0cc47a863622_0(e49139bb0abf8ee9f531216194501b8a73bc6462e6977b5c3d24c963bc2c9b64): Multus: Err adding pod to network "openshift-sdn": Multus: error in invoke Delegate add - "openshift-sdn": CNI request failed with status 400: 'Get https://api-int.ci-op-6s5tcgwg-a4af7.origin-ci-int-aws.dev.rhcloud.com:6443/api/v1/namespaces/e2e-persistent-local-volumes-test-9509/pods/security-context-a4b2eb02-ffda-11e9-95df-0a58ac10d2e8: dial tcp: lookup api-int.ci-op-6s5tcgwg-a4af7.origin-ci-int-aws.dev.rhcloud.com on 147.75.207.207:53: no such host
'
Nov  5 14:47:06.700: INFO: At 2019-11-05 14:44:22 +0000 UTC - event for security-context-a3eebab7-ffda-11e9-95df-0a58ac10d2e8: {default-scheduler } FailedScheduling: 0/6 nodes are available: 1 node(s) didn't find available persistent volumes to bind, 5 node(s) had taints that the pod didn't tolerate.
Nov  5 14:47:06.700: INFO: At 2019-11-05 14:44:22 +0000 UTC - event for security-context-a57f654b-ffda-11e9-95df-0a58ac10d2e8: {default-scheduler } FailedScheduling: 0/6 nodes are available: 1 node(s) didn't find available persistent volumes to bind, 5 node(s) had taints that the pod didn't tolerate.
Nov  5 14:47:06.700: INFO: At 2019-11-05 14:44:22 +0000 UTC - event for security-context-a71974c6-ffda-11e9-95df-0a58ac10d2e8: {default-scheduler } FailedScheduling: 0/6 nodes are available: 1 node(s) didn't find available persistent volumes to bind, 5 node(s) had taints that the pod didn't tolerate.
Nov  5 14:47:06.700: INFO: At 2019-11-05 14:44:22 +0000 UTC - event for security-context-ab9861d9-ffda-11e9-95df-0a58ac10d2e8: {default-scheduler } FailedScheduling: 0/6 nodes are available: 1 node(s) didn't find available persistent volumes to bind, 5 node(s) had taints that the pod didn't tolerate.
Nov  5 14:47:06.700: INFO: At 2019-11-05 14:44:22 +0000 UTC - event for security-context-abc73c2b-ffda-11e9-95df-0a58ac10d2e8: {default-scheduler } FailedScheduling: 0/6 nodes are available: 1 node(s) didn't find available persistent volumes to bind, 5 node(s) had taints that the pod didn't tolerate.
Nov  5 14:47:06.700: INFO: At 2019-11-05 14:44:22 +0000 UTC - event for security-context-abf60015-ffda-11e9-95df-0a58ac10d2e8: {default-scheduler } FailedScheduling: 0/6 nodes are available: 1 node(s) didn't find available persistent volumes to bind, 5 node(s) had taints that the pod didn't tolerate.
Nov  5 14:47:06.700: INFO: At 2019-11-05 14:44:22 +0000 UTC - event for security-context-ac24d9ef-ffda-11e9-95df-0a58ac10d2e8: {default-scheduler } FailedScheduling: 0/6 nodes are available: 1 node(s) didn't find available persistent volumes to bind, 5 node(s) had taints that the pod didn't tolerate.
Nov  5 14:47:06.700: INFO: At 2019-11-05 14:44:22 +0000 UTC - event for security-context-ac53cb90-ffda-11e9-95df-0a58ac10d2e8: {default-scheduler } FailedScheduling: 0/6 nodes are available: 1 node(s) didn't find available persistent volumes to bind, 5 node(s) had taints that the pod didn't tolerate.
Nov  5 14:47:06.700: INFO: At 2019-11-05 14:44:24 +0000 UTC - event for security-context-a4b2eb02-ffda-11e9-95df-0a58ac10d2e8: {kubelet worker-0.ci-op-6s5tcgwg-a4af7.origin-ci-int-aws.dev.rhcloud.com} FailedCreatePodSandBox: Failed create pod sandbox: rpc error: code = Unknown desc = failed to create pod network sandbox k8s_security-context-a4b2eb02-ffda-11e9-95df-0a58ac10d2e8_e2e-persistent-local-volumes-test-9509_a4dc742c-ffda-11e9-b252-0cc47a863622_0(01206b3e0d6044d24a6b378bf4fbca96f75cb7a2e701d64f3c3a2d3bd61475ad): Multus: Err adding pod to network "openshift-sdn": Multus: error in invoke Delegate add - "openshift-sdn": CNI request failed with status 400: 'Get https://api-int.ci-op-6s5tcgwg-a4af7.origin-ci-int-aws.dev.rhcloud.com:6443/api/v1/namespaces/e2e-persistent-local-volumes-test-9509/pods/security-context-a4b2eb02-ffda-11e9-95df-0a58ac10d2e8: dial tcp: lookup api-int.ci-op-6s5tcgwg-a4af7.origin-ci-int-aws.dev.rhcloud.com on 147.75.207.207:53: no such host
'
Nov  5 14:47:06.700: INFO: At 2019-11-05 14:44:30 +0000 UTC - event for security-context-a64cabdf-ffda-11e9-95df-0a58ac10d2e8: {default-scheduler } FailedScheduling: Timeout: request did not complete within requested timeout 34s
Nov  5 14:47:06.700: INFO: At 2019-11-05 14:44:44 +0000 UTC - event for security-context-a4b2eb02-ffda-11e9-95df-0a58ac10d2e8: {kubelet worker-0.ci-op-6s5tcgwg-a4af7.origin-ci-int-aws.dev.rhcloud.com} FailedCreatePodSandBox: Failed create pod sandbox: rpc error: code = Unknown desc = failed to create pod network sandbox k8s_security-context-a4b2eb02-ffda-11e9-95df-0a58ac10d2e8_e2e-persistent-local-volumes-test-9509_a4dc742c-ffda-11e9-b252-0cc47a863622_0(3ec35e43bbabe9f7136e2f30749943352d91e7075ce880969981e3f2c3148060): Multus: Err adding pod to network "openshift-sdn": Multus: error in invoke Delegate add - "openshift-sdn": CNI request failed with status 400: 'Get https://api-int.ci-op-6s5tcgwg-a4af7.origin-ci-int-aws.dev.rhcloud.com:6443/api/v1/namespaces/e2e-persistent-local-volumes-test-9509/pods/security-context-a4b2eb02-ffda-11e9-95df-0a58ac10d2e8: dial tcp: lookup api-int.ci-op-6s5tcgwg-a4af7.origin-ci-int-aws.dev.rhcloud.com on 147.75.207.207:53: no such host
'
Nov  5 14:47:06.700: INFO: At 2019-11-05 14:45:05 +0000 UTC - event for security-context-a4b2eb02-ffda-11e9-95df-0a58ac10d2e8: {kubelet worker-0.ci-op-6s5tcgwg-a4af7.origin-ci-int-aws.dev.rhcloud.com} FailedCreatePodSandBox: Failed create pod sandbox: rpc error: code = Unknown desc = failed to create pod network sandbox k8s_security-context-a4b2eb02-ffda-11e9-95df-0a58ac10d2e8_e2e-persistent-local-volumes-test-9509_a4dc742c-ffda-11e9-b252-0cc47a863622_0(6cf2ac205fa07231dc71e6db59a430e7db5f23855732d9cfddc4d3bbef5966af): Multus: Err adding pod to network "openshift-sdn": Multus: error in invoke Delegate add - "openshift-sdn": CNI request failed with status 400: 'Get https://api-int.ci-op-6s5tcgwg-a4af7.origin-ci-int-aws.dev.rhcloud.com:6443/api/v1/namespaces/e2e-persistent-local-volumes-test-9509/pods/security-context-a4b2eb02-ffda-11e9-95df-0a58ac10d2e8: dial tcp: lookup api-int.ci-op-6s5tcgwg-a4af7.origin-ci-int-aws.dev.rhcloud.com on 147.75.207.207:53: no such host
'
Nov  5 14:47:06.700: INFO: At 2019-11-05 14:45:24 +0000 UTC - event for security-context-a4b2eb02-ffda-11e9-95df-0a58ac10d2e8: {kubelet worker-0.ci-op-6s5tcgwg-a4af7.origin-ci-int-aws.dev.rhcloud.com} FailedCreatePodSandBox: Failed create pod sandbox: rpc error: code = Unknown desc = failed to create pod network sandbox k8s_security-context-a4b2eb02-ffda-11e9-95df-0a58ac10d2e8_e2e-persistent-local-volumes-test-9509_a4dc742c-ffda-11e9-b252-0cc47a863622_0(fae943d6d8bfe2dee495c71a699686010cc7b49b9dc0047c329c0f3c31a50c2c): Multus: Err adding pod to network "openshift-sdn": Multus: error in invoke Delegate add - "openshift-sdn": CNI request failed with status 400: 'Get https://api-int.ci-op-6s5tcgwg-a4af7.origin-ci-int-aws.dev.rhcloud.com:6443/api/v1/namespaces/e2e-persistent-local-volumes-test-9509/pods/security-context-a4b2eb02-ffda-11e9-95df-0a58ac10d2e8: dial tcp: lookup api-int.ci-op-6s5tcgwg-a4af7.origin-ci-int-aws.dev.rhcloud.com on 147.75.207.207:53: no such host
'
Nov  5 14:47:06.700: INFO: At 2019-11-05 14:45:44 +0000 UTC - event for security-context-a4b2eb02-ffda-11e9-95df-0a58ac10d2e8: {kubelet worker-0.ci-op-6s5tcgwg-a4af7.origin-ci-int-aws.dev.rhcloud.com} FailedCreatePodSandBox: Failed create pod sandbox: rpc error: code = Unknown desc = failed to create pod network sandbox k8s_security-context-a4b2eb02-ffda-11e9-95df-0a58ac10d2e8_e2e-persistent-local-volumes-test-9509_a4dc742c-ffda-11e9-b252-0cc47a863622_0(e45755d0df09a1b7547367213e42048107f51d9debd4ab9e164403ab41c375b5): Multus: Err adding pod to network "openshift-sdn": Multus: error in invoke Delegate add - "openshift-sdn": CNI request failed with status 400: 'Get https://api-int.ci-op-6s5tcgwg-a4af7.origin-ci-int-aws.dev.rhcloud.com:6443/api/v1/namespaces/e2e-persistent-local-volumes-test-9509/pods/security-context-a4b2eb02-ffda-11e9-95df-0a58ac10d2e8: dial tcp: lookup api-int.ci-op-6s5tcgwg-a4af7.origin-ci-int-aws.dev.rhcloud.com on 147.75.207.207:53: no such host
'
Nov  5 14:47:06.700: INFO: At 2019-11-05 14:46:03 +0000 UTC - event for security-context-a4b2eb02-ffda-11e9-95df-0a58ac10d2e8: {kubelet worker-0.ci-op-6s5tcgwg-a4af7.origin-ci-int-aws.dev.rhcloud.com} FailedCreatePodSandBox: Failed create pod sandbox: rpc error: code = Unknown desc = failed to create pod network sandbox k8s_security-context-a4b2eb02-ffda-11e9-95df-0a58ac10d2e8_e2e-persistent-local-volumes-test-9509_a4dc742c-ffda-11e9-b252-0cc47a863622_0(d9a822d1dd907c3b44a8ac946dcd53e6d03b312507f369d83b8b2851afaf3b90): Multus: Err adding pod to network "openshift-sdn": Multus: error in invoke Delegate add - "openshift-sdn": CNI request failed with status 400: 'Get https://api-int.ci-op-6s5tcgwg-a4af7.origin-ci-int-aws.dev.rhcloud.com:6443/api/v1/namespaces/e2e-persistent-local-volumes-test-9509/pods/security-context-a4b2eb02-ffda-11e9-95df-0a58ac10d2e8: dial tcp: lookup api-int.ci-op-6s5tcgwg-a4af7.origin-ci-int-aws.dev.rhcloud.com on 147.75.207.207:53: no such host
'
Nov  5 14:47:06.700: INFO: At 2019-11-05 14:46:22 +0000 UTC - event for security-context-a4b2eb02-ffda-11e9-95df-0a58ac10d2e8: {kubelet worker-0.ci-op-6s5tcgwg-a4af7.origin-ci-int-aws.dev.rhcloud.com} FailedCreatePodSandBox: Failed create pod sandbox: rpc error: code = Unknown desc = failed to create pod network sandbox k8s_security-context-a4b2eb02-ffda-11e9-95df-0a58ac10d2e8_e2e-persistent-local-volumes-test-9509_a4dc742c-ffda-11e9-b252-0cc47a863622_0(223ef2e6f890b662de2b8e3765cad9f136dc939fd090ac4fc3afe831ab97c293): Multus: Err adding pod to network "openshift-sdn": Multus: error in invoke Delegate add - "openshift-sdn": CNI request failed with status 400: 'Get https://api-int.ci-op-6s5tcgwg-a4af7.origin-ci-int-aws.dev.rhcloud.com:6443/api/v1/namespaces/e2e-persistent-local-volumes-test-9509/pods/security-context-a4b2eb02-ffda-11e9-95df-0a58ac10d2e8: dial tcp: lookup api-int.ci-op-6s5tcgwg-a4af7.origin-ci-int-aws.dev.rhcloud.com on 147.75.207.207:53: no such host
'
Nov  5 14:47:06.700: INFO: At 2019-11-05 14:46:40 +0000 UTC - event for security-context-a4b2eb02-ffda-11e9-95df-0a58ac10d2e8: {kubelet worker-0.ci-op-6s5tcgwg-a4af7.origin-ci-int-aws.dev.rhcloud.com} FailedCreatePodSandBox: (combined from similar events): Failed create pod sandbox: rpc error: code = Unknown desc = failed to create pod network sandbox k8s_security-context-a4b2eb02-ffda-11e9-95df-0a58ac10d2e8_e2e-persistent-local-volumes-test-9509_a4dc742c-ffda-11e9-b252-0cc47a863622_0(0682ebc6548cd9569d21468e80b8c05c8f844d225d6642eea860f54963523579): Multus: Err adding pod to network "openshift-sdn": Multus: error in invoke Delegate add - "openshift-sdn": CNI request failed with status 400: 'Get https://api-int.ci-op-6s5tcgwg-a4af7.origin-ci-int-aws.dev.rhcloud.com:6443/api/v1/namespaces/e2e-persistent-local-volumes-test-9509/pods/security-context-a4b2eb02-ffda-11e9-95df-0a58ac10d2e8: dial tcp: lookup api-int.ci-op-6s5tcgwg-a4af7.origin-ci-int-aws.dev.rhcloud.com on 147.75.207.207:53: no such host
'
Nov  5 14:47:06.700: INFO: At 2019-11-05 14:47:01 +0000 UTC - event for security-context-a3eebab7-ffda-11e9-95df-0a58ac10d2e8: {default-scheduler } FailedScheduling: skip schedule deleting pod: e2e-persistent-local-volumes-test-9509/security-context-a3eebab7-ffda-11e9-95df-0a58ac10d2e8
Nov  5 14:47:06.700: INFO: At 2019-11-05 14:47:02 +0000 UTC - event for security-context-a57f654b-ffda-11e9-95df-0a58ac10d2e8: {default-scheduler } FailedScheduling: skip schedule deleting pod: e2e-persistent-local-volumes-test-9509/security-context-a57f654b-ffda-11e9-95df-0a58ac10d2e8
Nov  5 14:47:06.700: INFO: At 2019-11-05 14:47:02 +0000 UTC - event for security-context-ab9861d9-ffda-11e9-95df-0a58ac10d2e8: {default-scheduler } FailedScheduling: skip schedule deleting pod: e2e-persistent-local-volumes-test-9509/security-context-ab9861d9-ffda-11e9-95df-0a58ac10d2e8
Nov  5 14:47:06.700: INFO: At 2019-11-05 14:47:03 +0000 UTC - event for security-context-a64cabdf-ffda-11e9-95df-0a58ac10d2e8: {default-scheduler } FailedScheduling: skip schedule deleting pod: e2e-persistent-local-volumes-test-9509/security-context-a64cabdf-ffda-11e9-95df-0a58ac10d2e8
Nov  5 14:47:06.700: INFO: At 2019-11-05 14:47:03 +0000 UTC - event for security-context-abf60015-ffda-11e9-95df-0a58ac10d2e8: {default-scheduler } FailedScheduling: skip schedule deleting pod: e2e-persistent-local-volumes-test-9509/security-context-abf60015-ffda-11e9-95df-0a58ac10d2e8
Nov  5 14:47:06.700: INFO: At 2019-11-05 14:47:03 +0000 UTC - event for security-context-ac24d9ef-ffda-11e9-95df-0a58ac10d2e8: {default-scheduler } FailedScheduling: skip schedule deleting pod: e2e-persistent-local-volumes-test-9509/security-context-ac24d9ef-ffda-11e9-95df-0a58ac10d2e8
Nov  5 14:47:06.700: INFO: At 2019-11-05 14:47:03 +0000 UTC - event for security-context-ac53cb90-ffda-11e9-95df-0a58ac10d2e8: {default-scheduler } FailedScheduling: skip schedule deleting pod: e2e-persistent-local-volumes-test-9509/security-context-ac53cb90-ffda-11e9-95df-0a58ac10d2e8
Nov  5 14:47:06.700: INFO: At 2019-11-05 14:47:04 +0000 UTC - event for security-context-a71974c6-ffda-11e9-95df-0a58ac10d2e8: {default-scheduler } FailedScheduling: skip schedule deleting pod: e2e-persistent-local-volumes-test-9509/security-context-a71974c6-ffda-11e9-95df-0a58ac10d2e8
Nov  5 14:47:06.700: INFO: At 2019-11-05 14:47:04 +0000 UTC - event for security-context-abc73c2b-ffda-11e9-95df-0a58ac10d2e8: {default-scheduler } FailedScheduling: skip schedule deleting pod: e2e-persistent-local-volumes-test-9509/security-context-abc73c2b-ffda-11e9-95df-0a58ac10d2e8
Nov  5 14:47:06.775: INFO: POD                                                                       NODE                                                             PHASE    GRACE  CONDITIONS
Nov  5 14:47:06.776: INFO: hostexec-worker-0.ci-op-6s5tcgwg-a4af7.origin-ci-int-aws.dev.rhcloud.com  worker-0.ci-op-6s5tcgwg-a4af7.origin-ci-int-aws.dev.rhcloud.com  Running         [{Initialized True 0001-01-01 00:00:00 +0000 UTC 2019-11-05 14:40:31 +0000 UTC  } {Ready True 0001-01-01 00:00:00 +0000 UTC 2019-11-05 14:40:32 +0000 UTC  } {ContainersReady True 0001-01-01 00:00:00 +0000 UTC 2019-11-05 14:40:32 +0000 UTC  } {PodScheduled True 0001-01-01 00:00:00 +0000 UTC 2019-11-05 14:40:31 +0000 UTC  }]
Nov  5 14:47:06.776: INFO: hostexec-worker-1.ci-op-6s5tcgwg-a4af7.origin-ci-int-aws.dev.rhcloud.com  worker-1.ci-op-6s5tcgwg-a4af7.origin-ci-int-aws.dev.rhcloud.com  Running         [{Initialized True 0001-01-01 00:00:00 +0000 UTC 2019-11-05 14:40:54 +0000 UTC  } {Ready False 0001-01-01 00:00:00 +0000 UTC 2019-11-05 14:40:55 +0000 UTC  } {ContainersReady True 0001-01-01 00:00:00 +0000 UTC 2019-11-05 14:40:55 +0000 UTC  } {PodScheduled True 0001-01-01 00:00:00 +0000 UTC 2019-11-05 14:40:54 +0000 UTC  }]
Nov  5 14:47:06.776: INFO: hostexec-worker-2.ci-op-6s5tcgwg-a4af7.origin-ci-int-aws.dev.rhcloud.com  worker-2.ci-op-6s5tcgwg-a4af7.origin-ci-int-aws.dev.rhcloud.com  Running         [{Initialized True 0001-01-01 00:00:00 +0000 UTC 2019-11-05 14:41:19 +0000 UTC  } {Ready False 0001-01-01 00:00:00 +0000 UTC 2019-11-05 14:41:20 +0000 UTC  } {ContainersReady True 0001-01-01 00:00:00 +0000 UTC 2019-11-05 14:41:20 +0000 UTC  } {PodScheduled True 0001-01-01 00:00:00 +0000 UTC 2019-11-05 14:41:19 +0000 UTC  }]
Nov  5 14:47:06.776: INFO: security-context-8ddce0bb-ffda-11e9-95df-0a58ac10d2e8                     worker-1.ci-op-6s5tcgwg-a4af7.origin-ci-int-aws.dev.rhcloud.com  Pending  30s    [{Initialized True 0001-01-01 00:00:00 +0000 UTC 2019-11-05 14:43:30 +0000 UTC  } {Ready False 0001-01-01 00:00:00 +0000 UTC 2019-11-05 14:43:30 +0000 UTC ContainersNotReady containers with unready status: [write-pod]} {ContainersReady False 0001-01-01 00:00:00 +0000 UTC 2019-11-05 14:43:30 +0000 UTC ContainersNotReady containers with unready status: [write-pod]} {PodScheduled True 0001-01-01 00:00:00 +0000 UTC 2019-11-05 14:43:30 +0000 UTC  }]
Nov  5 14:47:06.776: INFO: security-context-9104dedf-ffda-11e9-95df-0a58ac10d2e8                     worker-1.ci-op-6s5tcgwg-a4af7.origin-ci-int-aws.dev.rhcloud.com  Pending  30s    [{Initialized True 0001-01-01 00:00:00 +0000 UTC 2019-11-05 14:43:32 +0000 UTC  } {Ready False 0001-01-01 00:00:00 +0000 UTC 2019-11-05 14:43:32 +0000 UTC ContainersNotReady containers with unready status: [write-pod]} {ContainersReady False 0001-01-01 00:00:00 +0000 UTC 2019-11-05 14:43:32 +0000 UTC ContainersNotReady containers with unready status: [write-pod]} {PodScheduled True 0001-01-01 00:00:00 +0000 UTC 2019-11-05 14:43:32 +0000 UTC  }]
Nov  5 14:47:06.776: INFO: 
Nov  5 14:47:06.852: INFO: skipping dumping cluster info - cluster too large
Nov  5 14:47:06.852: INFO: Waiting up to 3m0s for all (but 100) nodes to be ready
Nov  5 14:47:06.928: INFO: Condition Ready of node master-0.ci-op-6s5tcgwg-a4af7.origin-ci-int-aws.dev.rhcloud.com is false instead of true. Reason: NodeStatusUnknown, message: Kubelet stopped posting node status.
Nov  5 14:47:06.928: INFO: Condition Ready of node master-1.ci-op-6s5tcgwg-a4af7.origin-ci-int-aws.dev.rhcloud.com is false, but Node is tainted by NodeController with [{node-role.kubernetes.io/master  NoSchedule <nil>} {node.kubernetes.io/unreachable  NoSchedule 2019-11-05 14:44:13 +0000 UTC} {node.kubernetes.io/unreachable  NoExecute 2019-11-05 14:44:18 +0000 UTC}]. Failure
Nov  5 14:47:06.928: INFO: Condition Ready of node worker-1.ci-op-6s5tcgwg-a4af7.origin-ci-int-aws.dev.rhcloud.com is false instead of true. Reason: NodeStatusUnknown, message: Kubelet stopped posting node status.
Nov  5 14:47:06.928: INFO: Condition Ready of node worker-2.ci-op-6s5tcgwg-a4af7.origin-ci-int-aws.dev.rhcloud.com is false instead of true. Reason: NodeStatusUnknown, message: Kubelet stopped posting node status.
STEP: Destroying namespace "e2e-persistent-local-volumes-test-9509" for this suite.
Nov  5 14:54:43.092: INFO: Error while waiting for namespace to be terminated: Get https://api.ci-op-6s5tcgwg-a4af7.origin-ci-int-aws.dev.rhcloud.com:6443/api/v1/namespaces/e2e-persistent-local-volumes-test-9509: dial tcp: lookup api.ci-op-6s5tcgwg-a4af7.origin-ci-int-aws.dev.rhcloud.com on 10.142.0.25:53: no such host
Nov  5 14:54:45.143: INFO: Error while waiting for namespace to be terminated: Get https://api.ci-op-6s5tcgwg-a4af7.origin-ci-int-aws.dev.rhcloud.com:6443/api/v1/namespaces/e2e-persistent-local-volumes-test-9509: dial tcp: lookup api.ci-op-6s5tcgwg-a4af7.origin-ci-int-aws.dev.rhcloud.com on 10.142.0.25:53: no such host
Nov  5 14:54:47.143: INFO: Error while waiting for namespace to be terminated: Get https://api.ci-op-6s5tcgwg-a4af7.origin-ci-int-aws.dev.rhcloud.com:6443/api/v1/namespaces/e2e-persistent-local-volumes-test-9509: dial tcp: lookup api.ci-op-6s5tcgwg-a4af7.origin-ci-int-aws.dev.rhcloud.com on 10.142.0.25:53: no such host
Nov  5 14:54:49.102: INFO: Error while waiting for namespace to be terminated: Get https://api.ci-op-6s5tcgwg-a4af7.origin-ci-int-aws.dev.rhcloud.com:6443/api/v1/namespaces/e2e-persistent-local-volumes-test-9509: dial tcp: lookup api.ci-op-6s5tcgwg-a4af7.origin-ci-int-aws.dev.rhcloud.com on 10.142.0.25:53: no such host
Nov  5 14:54:51.110: INFO: Error while waiting for namespace to be terminated: Get https://api.ci-op-6s5tcgwg-a4af7.origin-ci-int-aws.dev.rhcloud.com:6443/api/v1/namespaces/e2e-persistent-local-volumes-test-9509: dial tcp: lookup api.ci-op-6s5tcgwg-a4af7.origin-ci-int-aws.dev.rhcloud.com on 10.142.0.25:53: no such host
Nov  5 14:54:53.098: INFO: Error while waiting for namespace to be terminated: Get https://api.ci-op-6s5tcgwg-a4af7.origin-ci-int-aws.dev.rhcloud.com:6443/api/v1/namespaces/e2e-persistent-local-volumes-test-9509: dial tcp: lookup api.ci-op-6s5tcgwg-a4af7.origin-ci-int-aws.dev.rhcloud.com on 10.142.0.25:53: no such host
Nov  5 14:54:55.111: INFO: Error while waiting for namespace to be terminated: Get https://api.ci-op-6s5tcgwg-a4af7.origin-ci-int-aws.dev.rhcloud.com:6443/api/v1/namespaces/e2e-persistent-local-volumes-test-9509: dial tcp: lookup api.ci-op-6s5tcgwg-a4af7.origin-ci-int-aws.dev.rhcloud.com on 10.142.0.25:53: no such host
Nov  5 14:54:57.102: INFO: Error while waiting for namespace to be terminated: Get https://api.ci-op-6s5tcgwg-a4af7.origin-ci-int-aws.dev.rhcloud.com:6443/api/v1/namespaces/e2e-persistent-local-volumes-test-9509: dial tcp: lookup api.ci-op-6s5tcgwg-a4af7.origin-ci-int-aws.dev.rhcloud.com on 10.142.0.25:53: no such host
Nov  5 14:54:59.085: INFO: Error while waiting for namespace to be terminated: Get https://api.ci-op-6s5tcgwg-a4af7.origin-ci-int-aws.dev.rhcloud.com:6443/api/v1/namespaces/e2e-persistent-local-volumes-test-9509: dial tcp: lookup api.ci-op-6s5tcgwg-a4af7.origin-ci-int-aws.dev.rhcloud.com on 10.142.0.25:53: no such host
Nov  5 14:55:01.159: INFO: Error while waiting for namespace to be terminated: Get https://api.ci-op-6s5tcgwg-a4af7.origin-ci-int-aws.dev.rhcloud.com:6443/api/v1/namespaces/e2e-persistent-local-volumes-test-9509: dial tcp: lookup api.ci-op-6s5tcgwg-a4af7.origin-ci-int-aws.dev.rhcloud.com on 10.142.0.25:53: no such host
Nov  5 14:55:03.097: INFO: Error while waiting for namespace to be terminated: Get https://api.ci-op-6s5tcgwg-a4af7.origin-ci-int-aws.dev.rhcloud.com:6443/api/v1/namespaces/e2e-persistent-local-volumes-test-9509: dial tcp: lookup api.ci-op-6s5tcgwg-a4af7.origin-ci-int-aws.dev.rhcloud.com on 10.142.0.25:53: no such host
Nov  5 14:55:05.207: INFO: Error while waiting for namespace to be terminated: Get https://api.ci-op-6s5tcgwg-a4af7.origin-ci-int-aws.dev.rhcloud.com:6443/api/v1/namespaces/e2e-persistent-local-volumes-test-9509: dial tcp: lookup api.ci-op-6s5tcgwg-a4af7.origin-ci-int-aws.dev.rhcloud.com on 10.142.0.25:53: no such host
Nov  5 14:55:07.093: INFO: Error while waiting for namespace to be terminated: Get https://api.ci-op-6s5tcgwg-a4af7.origin-ci-int-aws.dev.rhcloud.com:6443/api/v1/namespaces/e2e-persistent-local-volumes-test-9509: dial tcp: lookup api.ci-op-6s5tcgwg-a4af7.origin-ci-int-aws.dev.rhcloud.com on 10.142.0.25:53: no such host
Nov  5 14:55:09.086: INFO: Error while waiting for namespace to be terminated: Get https://api.ci-op-6s5tcgwg-a4af7.origin-ci-int-aws.dev.rhcloud.com:6443/api/v1/namespaces/e2e-persistent-local-volumes-test-9509: dial tcp: lookup api.ci-op-6s5tcgwg-a4af7.origin-ci-int-aws.dev.rhcloud.com on 10.142.0.25:53: no such host
Nov  5 14:55:11.085: INFO: Error while waiting for namespace to be terminated: Get https://api.ci-op-6s5tcgwg-a4af7.origin-ci-int-aws.dev.rhcloud.com:6443/api/v1/namespaces/e2e-persistent-local-volumes-test-9509: dial tcp: lookup api.ci-op-6s5tcgwg-a4af7.origin-ci-int-aws.dev.rhcloud.com on 10.142.0.25:53: no such host
Nov  5 14:55:13.085: INFO: Error while waiting for namespace to be terminated: Get https://api.ci-op-6s5tcgwg-a4af7.origin-ci-int-aws.dev.rhcloud.com:6443/api/v1/namespaces/e2e-persistent-local-volumes-test-9509: dial tcp: lookup api.ci-op-6s5tcgwg-a4af7.origin-ci-int-aws.dev.rhcloud.com on 10.142.0.25:53: no such host
Nov  5 14:55:15.085: INFO: Error while waiting for namespace to be terminated: Get https://api.ci-op-6s5tcgwg-a4af7.origin-ci-int-aws.dev.rhcloud.com:6443/api/v1/namespaces/e2e-persistent-local-volumes-test-9509: dial tcp: lookup api.ci-op-6s5tcgwg-a4af7.origin-ci-int-aws.dev.rhcloud.com on 10.142.0.25:53: no such host
Nov  5 14:55:17.085: INFO: Error while waiting for namespace to be terminated: Get https://api.ci-op-6s5tcgwg-a4af7.origin-ci-int-aws.dev.rhcloud.com:6443/api/v1/namespaces/e2e-persistent-local-volumes-test-9509: dial tcp: lookup api.ci-op-6s5tcgwg-a4af7.origin-ci-int-aws.dev.rhcloud.com on 10.142.0.25:53: no such host
Nov  5 14:55:19.087: INFO: Error while waiting for namespace to be terminated: Get https://api.ci-op-6s5tcgwg-a4af7.origin-ci-int-aws.dev.rhcloud.com:6443/api/v1/namespaces/e2e-persistent-local-volumes-test-9509: dial tcp: lookup api.ci-op-6s5tcgwg-a4af7.origin-ci-int-aws.dev.rhcloud.com on 10.142.0.25:53: no such host
Nov  5 14:55:21.088: INFO: Error while waiting for namespace to be terminated: Get https://api.ci-op-6s5tcgwg-a4af7.origin-ci-int-aws.dev.rhcloud.com:6443/api/v1/namespaces/e2e-persistent-local-volumes-test-9509: dial tcp: lookup api.ci-op-6s5tcgwg-a4af7.origin-ci-int-aws.dev.rhcloud.com on 10.142.0.25:53: no such host

---------------------------------------------------------
Received interrupt.  Running AfterSuite...
^C again to terminate immediately
Nov  5 14:55:21.207: INFO: Running AfterSuite actions on all nodes
Nov  5 14:55:21.207: INFO: Running AfterSuite actions on node 1
				
				Click to see stdout/stderrfrom junit_e2e_20191105-145709.xml

Find didnt mentions in log files


openshift-tests [sig-storage] [Serial] Volume metrics should create volume metrics with the correct PVC ref [Suite:openshift/conformance/serial] [Suite:k8s] 2.00s

go run hack/e2e.go -v -test --test_args='--ginkgo.focus=openshift\-tests\s\[sig\-storage\]\s\[Serial\]\sVolume\smetrics\sshould\screate\svolume\smetrics\swith\sthe\scorrect\sPVC\sref\s\[Suite\:openshift\/conformance\/serial\]\s\[Suite\:k8s\]$'
fail [k8s.io/kubernetes/test/e2e/e2e.go:104]: Unexpected error:
    <*url.Error | 0xc0035b2b40>: {
        Op: "Get",
        URL: "https://api.ci-op-6s5tcgwg-a4af7.origin-ci-int-aws.dev.rhcloud.com:6443/api/v1/nodes?fieldSelector=spec.unschedulable%3Dfalse&resourceVersion=0",
        Err: {
            Op: "dial",
            Net: "tcp",
            Source: nil,
            Addr: nil,
            Err: {
                Err: "no such host",
                Name: "api.ci-op-6s5tcgwg-a4af7.origin-ci-int-aws.dev.rhcloud.com",
                Server: "10.142.0.25:53",
                IsTimeout: false,
                IsTemporary: false,
            },
        },
    }
    Get https://api.ci-op-6s5tcgwg-a4af7.origin-ci-int-aws.dev.rhcloud.com:6443/api/v1/nodes?fieldSelector=spec.unschedulable%3Dfalse&resourceVersion=0: dial tcp: lookup api.ci-op-6s5tcgwg-a4af7.origin-ci-int-aws.dev.rhcloud.com on 10.142.0.25:53: no such host
occurred
				
				Click to see stdout/stderrfrom junit_e2e_20191105-145709.xml

Filter through log files


operator Run template e2e-metal-serial - e2e-metal-serial container test 9m3s

go run hack/e2e.go -v -test --test_args='--ginkgo.focus=operator\sRun\stemplate\se2e\-metal\-serial\s\-\se2e\-metal\-serial\scontainer\stest$'
default fs)] volumes should allow exec of files on the volume [Suite:openshift/conformance/serial] [Suite:k8s] [Skipped:gce]
[sig-storage] In-tree Volumes [Driver: local][LocalVolumeType: gce-localssd-scsi-fs] [Serial] [Testpattern: Inline-volume (ext3)] volumes should be mountable [Suite:openshift/conformance/serial] [Suite:k8s] [Skipped:gce]
[sig-storage] In-tree Volumes [Driver: local][LocalVolumeType: gce-localssd-scsi-fs] [Serial] [Testpattern: Inline-volume (ntfs)][sig-windows] volumes should be mountable [Suite:openshift/conformance/serial] [Suite:k8s] [Skipped:gce]
[sig-storage] In-tree Volumes [Driver: local][LocalVolumeType: gce-localssd-scsi-fs] [Serial] [Testpattern: Pre-provisioned PV (default fs)] subPath should support existing directories when readOnly specified in the volumeSource [Suite:openshift/conformance/serial] [Suite:k8s] [Skipped:gce]
[sig-storage] In-tree Volumes [Driver: local][LocalVolumeType: gce-localssd-scsi-fs] [Serial] [Testpattern: Pre-provisioned PV (default fs)] subPath should support non-existent path [Suite:openshift/conformance/serial] [Suite:k8s] [Skipped:gce]
[sig-storage] In-tree Volumes [Driver: local][LocalVolumeType: gce-localssd-scsi-fs] [Serial] [Testpattern: Pre-provisioned PV (ntfs)][sig-windows] volumes should be mountable [Suite:openshift/conformance/serial] [Suite:k8s] [Skipped:gce]
[sig-storage] In-tree Volumes [Driver: local][LocalVolumeType: gce-localssd-scsi-fs] [Serial] [Testpattern: Pre-provisioned PV (xfs)] volumes should allow exec of files on the volume [Suite:openshift/conformance/serial] [Suite:k8s] [Skipped:gce]
[sig-storage] PersistentVolumes-local  Stress with local volumes [Serial] should be able to process many pods and reuse local volumes [Suite:openshift/conformance/serial] [Suite:k8s]
[sig-storage] [Serial] Volume metrics should create volume metrics with the correct PVC ref [Suite:openshift/conformance/serial] [Suite:k8s]

Writing JUnit report to /tmp/artifacts/junit/junit_e2e_20191105-145709.xml

error: 47 fail, 30 pass, 139 skip (2h29m32s)

				from junit_operator.xml

Filter through log files


Show 34 Passed Tests

Show 139 Skipped Tests