ResultFAILURE
Tests 2 failed / 4 succeeded
Started2019-11-05 11:23
Elapsed7m47s
Work namespaceci-op-p612tsqt
pod4.2.0-0.nightly-2019-11-05-111920-openstack

Test Failures


operator Run template e2e-openstack - e2e-openstack container setup 2m46s

go run hack/e2e.go -v -test --test_args='--ginkgo.focus=operator\sRun\stemplate\se2e\-openstack\s\-\se2e\-openstack\scontainer\ssetup$'
 error: %!s(<nil>)"
level=debug msg="2019/11/05 11:28:38 [ERROR] module.masters: eval: *terraform.EvalApplyPost, err: Error waiting for instance (402efe6f-2fde-4296-9f6b-9791f57f8f3e) to become ready: unexpected state 'ERROR', wanted target 'ACTIVE'. last error: %!s(<nil>)"
level=debug msg="2019/11/05 11:28:38 [ERROR] module.masters: eval: *terraform.EvalSequence, err: Error waiting for instance (402efe6f-2fde-4296-9f6b-9791f57f8f3e) to become ready: unexpected state 'ERROR', wanted target 'ACTIVE'. last error: %!s(<nil>)"
level=error
level=error msg="Error: Error waiting for instance (402efe6f-2fde-4296-9f6b-9791f57f8f3e) to become ready: unexpected state 'ERROR', wanted target 'ACTIVE'. last error: %!s(<nil>)"
level=error
level=error msg="  on ../tmp/openshift-install-010438204/masters/main.tf line 44, in resource \"openstack_compute_instance_v2\" \"master_conf\":"
level=error msg="  44: resource \"openstack_compute_instance_v2\" \"master_conf\" {"
level=error
level=error
level=error
level=error msg="Error: Error waiting for instance (87f6cccf-d4c6-4ca0-ab66-71eaa9da7af7) to become ready: unexpected state 'ERROR', wanted target 'ACTIVE'. last error: %!s(<nil>)"
level=error
level=error msg="  on ../tmp/openshift-install-010438204/masters/main.tf line 44, in resource \"openstack_compute_instance_v2\" \"master_conf\":"
level=error msg="  44: resource \"openstack_compute_instance_v2\" \"master_conf\" {"
level=error
level=error
level=error
level=error msg="Error: Error waiting for instance (253d249f-0b58-4700-9998-821d694cdc2c) to become ready: unexpected state 'ERROR', wanted target 'ACTIVE'. last error: %!s(<nil>)"
level=error
level=error msg="  on ../tmp/openshift-install-010438204/masters/main.tf line 44, in resource \"openstack_compute_instance_v2\" \"master_conf\":"
level=error msg="  44: resource \"openstack_compute_instance_v2\" \"master_conf\" {"
level=error
level=error
level=fatal msg="failed to fetch Cluster: failed to generate asset \"Cluster\": failed to create cluster: failed to apply using Terraform"

				from junit_operator.xml

Filter through log files


operator Run template e2e-openstack - e2e-openstack container test 14s

go run hack/e2e.go -v -test --test_args='--ginkgo.focus=operator\sRun\stemplate\se2e\-openstack\s\-\se2e\-openstack\scontainer\stest$'
Another process exited

				from junit_operator.xml

Filter through log files


Show 4 Passed Tests