ResultSUCCESS
Tests 1 failed / 901 succeeded
Started2019-11-07 23:26
Elapsed1h30m
Work namespaceci-op-1k3cmf5l
pod4.2.0-0.nightly-2019-11-07-231418-openstack

Test Failures


openshift-tests [sig-cli] Kubectl client [k8s.io] Kubectl client-side validation should create/apply a valid CR with arbitrary-extra properties for CRD with partially-specified validation schema [Suite:openshift/conformance/parallel] [Suite:k8s] 26s

go run hack/e2e.go -v -test --test_args='--ginkgo.focus=openshift\-tests\s\[sig\-cli\]\sKubectl\sclient\s\[k8s\.io\]\sKubectl\sclient\-side\svalidation\sshould\screate\/apply\sa\svalid\sCR\swith\sarbitrary\-extra\sproperties\sfor\sCRD\swith\spartially\-specified\svalidation\sschema\s\[Suite\:openshift\/conformance\/parallel\]\s\[Suite\:k8s\]$'
fail [k8s.io/kubernetes/test/e2e/kubectl/kubectl.go:959]: Nov  8 00:25:39.650: failed to apply CR {"kind":"E2e-test-kubectl-9961-crd","apiVersion":"kubectl-crd-test.k8s.io/v1","metadata":{"name":"test-cr"},"spec":{"bars":[{"name":"test-bar"}],"extraProperty":"arbitrary-value"}} in namespace --namespace=e2e-kubectl-5916: error running &{/tmp/shared/kubectl [kubectl --server=https://api.1k3cmf5l-ce98b.shiftstack.ci:6443 --kubeconfig=/tmp/admin.kubeconfig --namespace=e2e-kubectl-5916 apply --validate=true -f -] []  0xc003b4a520  error: error validating "STDIN": error validating data: ValidationError(E2e-test-kubectl-9961-crd.spec): unknown field "extraProperty" in io.k8s.kubectl-crd-test.v1.E2e-test-kubectl-9961-crd.spec; if you choose to ignore these errors, turn validation off with --validate=false
 [] <nil> 0xc00383a540 exit status 1 <nil> <nil> true [0xc003842000 0xc003842028 0xc003842038] [0xc003842000 0xc003842028 0xc003842038] [0xc003842008 0xc003842020 0xc003842030] [0x95bdc0 0x95bef0 0x95bef0] 0xc003844240 <nil>}:
Command stdout:

stderr:
error: error validating "STDIN": error validating data: ValidationError(E2e-test-kubectl-9961-crd.spec): unknown field "extraProperty" in io.k8s.kubectl-crd-test.v1.E2e-test-kubectl-9961-crd.spec; if you choose to ignore these errors, turn validation off with --validate=false

error:
exit status 1
				
				Click to see stdout/stderrfrom junit_e2e_20191108-004626.xml

Filter through log files


Show 901 Passed Tests

Show 1248 Skipped Tests