ResultFAILURE
Tests 2 failed / 4 succeeded
Started2019-11-08 01:32
Elapsed9m12s
Work namespaceci-op-ctrb6djq
pod4.2.0-0.nightly-2019-11-08-012816-openstack-serial

Test Failures


operator Run template e2e-openstack-serial - e2e-openstack-serial container setup 2m7s

go run hack/e2e.go -v -test --test_args='--ginkgo.focus=operator\sRun\stemplate\se2e\-openstack\-serial\s\-\se2e\-openstack\-serial\scontainer\ssetup$'
 error: %!s(<nil>)"
level=debug msg="2019/11/08 01:37:38 [ERROR] module.masters: eval: *terraform.EvalApplyPost, err: Error waiting for instance (840704ce-34aa-4be6-9c08-d370c8b23b07) to become ready: unexpected state 'ERROR', wanted target 'ACTIVE'. last error: %!s(<nil>)"
level=debug msg="2019/11/08 01:37:38 [ERROR] module.masters: eval: *terraform.EvalSequence, err: Error waiting for instance (840704ce-34aa-4be6-9c08-d370c8b23b07) to become ready: unexpected state 'ERROR', wanted target 'ACTIVE'. last error: %!s(<nil>)"
level=error
level=error msg="Error: Error waiting for instance (840704ce-34aa-4be6-9c08-d370c8b23b07) to become ready: unexpected state 'ERROR', wanted target 'ACTIVE'. last error: %!s(<nil>)"
level=error
level=error msg="  on ../tmp/openshift-install-700468826/masters/main.tf line 44, in resource \"openstack_compute_instance_v2\" \"master_conf\":"
level=error msg="  44: resource \"openstack_compute_instance_v2\" \"master_conf\" {"
level=error
level=error
level=error
level=error msg="Error: Error waiting for instance (069f1c13-342f-4af1-9bad-173789d5e240) to become ready: unexpected state 'ERROR', wanted target 'ACTIVE'. last error: %!s(<nil>)"
level=error
level=error msg="  on ../tmp/openshift-install-700468826/masters/main.tf line 44, in resource \"openstack_compute_instance_v2\" \"master_conf\":"
level=error msg="  44: resource \"openstack_compute_instance_v2\" \"master_conf\" {"
level=error
level=error
level=error
level=error msg="Error: Error waiting for instance (c377818a-5d0c-4777-b393-313fdab59678) to become ready: unexpected state 'ERROR', wanted target 'ACTIVE'. last error: %!s(<nil>)"
level=error
level=error msg="  on ../tmp/openshift-install-700468826/masters/main.tf line 44, in resource \"openstack_compute_instance_v2\" \"master_conf\":"
level=error msg="  44: resource \"openstack_compute_instance_v2\" \"master_conf\" {"
level=error
level=error
level=fatal msg="failed to fetch Cluster: failed to generate asset \"Cluster\": failed to create cluster: failed to apply using Terraform"

				from junit_operator.xml

Filter through log files


operator Run template e2e-openstack-serial - e2e-openstack-serial container test 7.00s

go run hack/e2e.go -v -test --test_args='--ginkgo.focus=operator\sRun\stemplate\se2e\-openstack\-serial\s\-\se2e\-openstack\-serial\scontainer\stest$'
Another process exited

				from junit_operator.xml

Filter through log files


Show 4 Passed Tests