ResultFAILURE
Tests 1 failed / 4 succeeded
Started2020-02-12 10:10
Elapsed14m5s
Work namespaceci-op-9xmm0y8c
pod4.2.0-0.nightly-2020-02-12-100117-openstack-serial
revision1

Test Failures


operator Run template e2e-openstack-serial - e2e-openstack-serial container setup 2m21s

go run hack/e2e.go -v -test --test_args='--ginkgo.focus=operator\sRun\stemplate\se2e\-openstack\-serial\s\-\se2e\-openstack\-serial\scontainer\ssetup$'
pected state 'ERROR', wanted target 'ACTIVE'. last error: %!s(<nil>)"
level=error
level=error msg="Error: Error waiting for instance (b42966e3-60d5-49c4-8120-6935d1c44b11) to become ready: unexpected state 'ERROR', wanted target 'ACTIVE'. last error: %!s(<nil>)"
level=error
level=error msg="  on ../tmp/openshift-install-247274864/bootstrap/main.tf line 121, in resource \"openstack_compute_instance_v2\" \"bootstrap\":"
level=error msg=" 121: resource \"openstack_compute_instance_v2\" \"bootstrap\" {"
level=error
level=error
level=error
level=error msg="Error: Error waiting for instance (4fbe093b-5984-4c39-9417-5900aa36da82) to become ready: unexpected state 'ERROR', wanted target 'ACTIVE'. last error: %!s(<nil>)"
level=error
level=error msg="  on ../tmp/openshift-install-247274864/masters/main.tf line 44, in resource \"openstack_compute_instance_v2\" \"master_conf\":"
level=error msg="  44: resource \"openstack_compute_instance_v2\" \"master_conf\" {"
level=error
level=error
level=error
level=error msg="Error: Error waiting for instance (20d33645-ac87-49a7-86bb-d9986c0dfd0a) to become ready: unexpected state 'ERROR', wanted target 'ACTIVE'. last error: %!s(<nil>)"
level=error
level=error msg="  on ../tmp/openshift-install-247274864/masters/main.tf line 44, in resource \"openstack_compute_instance_v2\" \"master_conf\":"
level=error msg="  44: resource \"openstack_compute_instance_v2\" \"master_conf\" {"
level=error
level=error
level=error
level=error msg="Error: Error waiting for instance (94d7132d-ec86-408c-b497-2d09a3ccc182) to become ready: unexpected state 'ERROR', wanted target 'ACTIVE'. last error: %!s(<nil>)"
level=error
level=error msg="  on ../tmp/openshift-install-247274864/masters/main.tf line 44, in resource \"openstack_compute_instance_v2\" \"master_conf\":"
level=error msg="  44: resource \"openstack_compute_instance_v2\" \"master_conf\" {"
level=error
level=error
level=fatal msg="failed to fetch Cluster: failed to generate asset \"Cluster\": failed to create cluster: failed to apply using Terraform"

				from junit_operator.xml

Filter through log files


Show 4 Passed Tests

Error lines from build-log.txt

... skipping 3765 lines ...
level=debug msg="2020/02/12 10:15:26 [ERROR] module.bootstrap: eval: *terraform.EvalApplyPost, err: Error waiting for instance (b42966e3-60d5-49c4-8120-6935d1c44b11) to become ready: unexpected state 'ERROR', wanted target 'ACTIVE'. last error: %!s(<nil>)"
level=debug msg="2020/02/12 10:15:26 [ERROR] module.bootstrap: eval: *terraform.EvalSequence, err: Error waiting for instance (b42966e3-60d5-49c4-8120-6935d1c44b11) to become ready: unexpected state 'ERROR', wanted target 'ACTIVE'. last error: %!s(<nil>)"
... skipping 187 lines ...
level=debug msg="2020/02/12 10:16:40 [ERROR] module.masters: eval: *terraform.EvalApplyPost, err: Error waiting for instance (4fbe093b-5984-4c39-9417-5900aa36da82) to become ready: unexpected state 'ERROR', wanted target 'ACTIVE'. last error: %!s(<nil>)"
level=debug msg="2020/02/12 10:16:40 [ERROR] module.masters: eval: *terraform.EvalSequence, err: Error waiting for instance (4fbe093b-5984-4c39-9417-5900aa36da82) to become ready: unexpected state 'ERROR', wanted target 'ACTIVE'. last error: %!s(<nil>)"
level=debug msg="2020/02/12 10:16:40 [DEBUG] module.masters.openstack_compute_instance_v2.master_conf[2]: apply errored, but we're indicating that via the Error pointer rather than returning it: Error waiting for instance (20d33645-ac87-49a7-86bb-d9986c0dfd0a) to become ready: unexpected state 'ERROR', wanted target 'ACTIVE'. last error: %!s(<nil>)"
level=debug msg="2020/02/12 10:16:40 [ERROR] module.masters: eval: *terraform.EvalApplyPost, err: Error waiting for instance (20d33645-ac87-49a7-86bb-d9986c0dfd0a) to become ready: unexpected state 'ERROR', wanted target 'ACTIVE'. last error: %!s(<nil>)"
level=debug msg="2020/02/12 10:16:40 [ERROR] module.masters: eval: *terraform.EvalSequence, err: Error waiting for instance (20d33645-ac87-49a7-86bb-d9986c0dfd0a) to become ready: unexpected state 'ERROR', wanted target 'ACTIVE'. last error: %!s(<nil>)"
level=debug msg="2020/02/12 10:16:41 [DEBUG] module.masters.openstack_compute_instance_v2.master_conf[1]: apply errored, but we're indicating that via the Error pointer rather than returning it: Error waiting for instance (94d7132d-ec86-408c-b497-2d09a3ccc182) to become ready: unexpected state 'ERROR', wanted target 'ACTIVE'. last error: %!s(<nil>)"
level=debug msg="2020/02/12 10:16:41 [ERROR] module.masters: eval: *terraform.EvalApplyPost, err: Error waiting for instance (94d7132d-ec86-408c-b497-2d09a3ccc182) to become ready: unexpected state 'ERROR', wanted target 'ACTIVE'. last error: %!s(<nil>)"
level=debug msg="2020/02/12 10:16:41 [ERROR] module.masters: eval: *terraform.EvalSequence, err: Error waiting for instance (94d7132d-ec86-408c-b497-2d09a3ccc182) to become ready: unexpected state 'ERROR', wanted target 'ACTIVE'. last error: %!s(<nil>)"
... skipping 70 lines ...