ResultFAILURE
Tests 43 failed / 875 succeeded
Started2020-09-19 20:00
Elapsed2h13m
Work namespaceci-op-jyv2v8ft
podbcd37ffd-fab2-11ea-a1fd-0a580a800db2
revision1

Test Failures


openshift-tests [sig-apps][Feature:DeploymentConfig] deploymentconfigs with multiple image change triggers should run a successful deployment with multiple triggers [Suite:openshift/conformance/parallel] 5m23s

go run hack/e2e.go -v -test --test_args='--ginkgo.focus=openshift\-tests\s\[sig\-apps\]\[Feature\:DeploymentConfig\]\sdeploymentconfigs\swith\smultiple\simage\schange\striggers\sshould\srun\sa\ssuccessful\sdeployment\swith\smultiple\striggers\s\[Suite\:openshift\/conformance\/parallel\]$'
fail [github.com/openshift/origin/test/extended/deployments/deployments.go:551]: Unexpected error:
    <*errors.errorString | 0xc0002da8b0>: {
        s: "timed out waiting for the condition",
    }
    timed out waiting for the condition
occurred
				
				Click to see stdout/stderrfrom junit_e2e_20200919-220556.xml

Filter through log files


openshift-tests [sig-arch] Monitor cluster while tests execute 1h13m

go run hack/e2e.go -v -test --test_args='--ginkgo.focus=openshift\-tests\s\[sig\-arch\]\sMonitor\scluster\swhile\stests\sexecute$'
602 error level events were detected during this test run:

Sep 19 20:53:01.610 E ns/e2e-test-prometheus-nbn25 pod/execpodmsxcs node/ci-op-jyv2v8ft-694a5-zcv8h-worker-0-6w2n6 container/agnhost-pause container exited with code 137 (Error): 
Sep 19 20:53:46.010 E ns/e2e-test-build-pruning-rkcv2 pod/myphp-1-build node/ci-op-jyv2v8ft-694a5-zcv8h-worker-0-6w2n6 container/git-clone container exited with code 1 (Error): Cloning "https://github.com/openshift/non-working-example.git" ...\nerror: failed to fetch requested repository "https://github.com/openshift/non-working-example.git" with provided credentials\n
Sep 19 20:53:46.010 E ns/e2e-test-build-pruning-rkcv2 pod/myphp-1-build node/ci-op-jyv2v8ft-694a5-zcv8h-worker-0-6w2n6 reason/Failed (): 
Sep 19 20:53:46.010 E ns/e2e-test-build-pruning-rkcv2 pod/myphp-1-build node/ci-op-jyv2v8ft-694a5-zcv8h-worker-0-6w2n6 container/git-clone init container exited with code 1 (Error): Cloning "https://github.com/openshift/non-working-example.git" ...\nerror: failed to fetch requested repository "https://github.com/openshift/non-working-example.git" with provided credentials\n
Sep 19 20:53:57.893 E ns/e2e-test-build-pruning-rkcv2 pod/myphp-2-build node/ci-op-jyv2v8ft-694a5-zcv8h-worker-0-6w2n6 container/git-clone container exited with code 1 (Error): Cloning "https://github.com/openshift/non-working-example.git" ...\nerror: failed to fetch requested repository "https://github.com/openshift/non-working-example.git" with provided credentials\n
Sep 19 20:53:57.893 E ns/e2e-test-build-pruning-rkcv2 pod/myphp-2-build node/ci-op-jyv2v8ft-694a5-zcv8h-worker-0-6w2n6 reason/Failed (): 
Sep 19 20:53:57.893 E ns/e2e-test-build-pruning-rkcv2 pod/myphp-2-build node/ci-op-jyv2v8ft-694a5-zcv8h-worker-0-6w2n6 container/git-clone init container exited with code 1 (Error): Cloning "https://github.com/openshift/non-working-example.git" ...\nerror: failed to fetch requested repository "https://github.com/openshift/non-working-example.git" with provided credentials\n
Sep 19 20:54:04.859 E ns/e2e-test-build-pruning-rkcv2 pod/myphp-3-build node/ci-op-jyv2v8ft-694a5-zcv8h-worker-0-6w2n6 container/git-clone container exited with code 1 (Error): Cloning "https://github.com/openshift/non-working-example.git" ...\nerror: failed to fetch requested repository "https://github.com/openshift/non-working-example.git" with provided credentials\n
Sep 19 20:54:04.859 E ns/e2e-test-build-pruning-rkcv2 pod/myphp-3-build node/ci-op-jyv2v8ft-694a5-zcv8h-worker-0-6w2n6 reason/Failed (): 
Sep 19 20:54:04.859 E ns/e2e-test-build-pruning-rkcv2 pod/myphp-3-build node/ci-op-jyv2v8ft-694a5-zcv8h-worker-0-6w2n6 container/git-clone init container exited with code 1 (Error): Cloning "https://github.com/openshift/non-working-example.git" ...\nerror: failed to fetch requested repository "https://github.com/openshift/non-working-example.git" with provided credentials\n
Sep 19 20:54:19.333 E ns/e2e-test-build-pruning-rkcv2 pod/myphp-4-build node/ci-op-jyv2v8ft-694a5-zcv8h-worker-0-xccxs container/git-clone container exited with code 1 (Error): Cloning "https://github.com/openshift/non-working-example.git" ...\nerror: failed to fetch requested repository "https://github.com/openshift/non-working-example.git" with provided credentials\n
Sep 19 20:54:19.333 E ns/e2e-test-build-pruning-rkcv2 pod/myphp-4-build node/ci-op-jyv2v8ft-694a5-zcv8h-worker-0-xccxs reason/Failed (): 
Sep 19 20:54:19.333 E ns/e2e-test-build-pruning-rkcv2 pod/myphp-4-build node/ci-op-jyv2v8ft-694a5-zcv8h-worker-0-xccxs container/git-clone init container exited with code 1 (Error): Cloning "https://github.com/openshift/non-working-example.git" ...\nerror: failed to fetch requested repository "https://github.com/openshift/non-working-example.git" with provided credentials\n
Sep 19 20:54:22.108 E ns/e2e-network-policy-2876 pod/client-a-wgxcs node/ci-op-jyv2v8ft-694a5-zcv8h-worker-0-6w2n6 container/client init container exited with code 1 (Error): 
Sep 19 20:54:22.108 E ns/e2e-network-policy-2876 pod/client-a-wgxcs node/ci-op-jyv2v8ft-694a5-zcv8h-worker-0-6w2n6 reason/Failed (): 
Sep 19 20:54:22.108 E ns/e2e-network-policy-2876 pod/client-a-wgxcs node/ci-op-jyv2v8ft-694a5-zcv8h-worker-0-6w2n6 container/client container exited with code 1 (Error): 
Sep 19 20:54:28.179 E ns/e2e-network-policy-2876 pod/server-tlgfm node/ci-op-jyv2v8ft-694a5-zcv8h-worker-0-6w2n6 container/server-container-81 init container exited with code 2 (Error): 
Sep 19 20:54:28.179 E ns/e2e-network-policy-2876 pod/server-tlgfm node/ci-op-jyv2v8ft-694a5-zcv8h-worker-0-6w2n6 container/server-container-80 init container exited with code 2 (Error): 
Sep 19 20:54:28.179 E ns/e2e-network-policy-2876 pod/server-tlgfm node/ci-op-jyv2v8ft-694a5-zcv8h-worker-0-6w2n6 reason/Failed (): 
Sep 19 20:54:28.179 E ns/e2e-network-policy-2876 pod/server-tlgfm node/ci-op-jyv2v8ft-694a5-zcv8h-worker-0-6w2n6 container/server-container-81 container exited with code 2 (Error): 
Sep 19 20:54:28.179 E ns/e2e-network-policy-2876 pod/server-tlgfm node/ci-op-jyv2v8ft-694a5-zcv8h-worker-0-6w2n6 container/server-container-80 container exited with code 2 (Error): 
Sep 19 20:54:31.300 E ns/e2e-pods-3305 pod/pod-update-activedeadlineseconds-e20fa527-c7ac-4fde-9862-4d397ef240aa node/ci-op-jyv2v8ft-694a5-zcv8h-worker-0-6w2n6 reason/Failed (DeadlineExceeded): Pod was active on the node longer than the specified deadline
Sep 19 20:55:24.821 E ns/e2e-svcaccounts-7649 pod/pod-service-account-defaultsa node/ci-op-jyv2v8ft-694a5-zcv8h-worker-0-6w2n6 container/token-test init container exited with code 2 (Error): 
Sep 19 20:55:24.821 E ns/e2e-svcaccounts-7649 pod/pod-service-account-defaultsa node/ci-op-jyv2v8ft-694a5-zcv8h-worker-0-6w2n6 reason/Failed (): 
Sep 19 20:55:24.821 E ns/e2e-svcaccounts-7649 pod/pod-service-account-defaultsa node/ci-op-jyv2v8ft-694a5-zcv8h-worker-0-6w2n6 container/token-test container exited with code 2 (Error): 
Sep 19 20:55:46.078 E ns/e2e-statefulset-500 pod/ss-0 node/ci-op-jyv2v8ft-694a5-zcv8h-worker-0-6w2n6 reason/Failed (NodePorts): Pod Predicate NodePorts failed
Sep 19 20:55:46.126 E ns/e2e-statefulset-500 pod/ss-0 node/ci-op-jyv2v8ft-694a5-zcv8h-worker-0-6w2n6 reason/Failed (NodePorts): Pod Predicate NodePorts failed
Sep 19 20:55:46.197 E ns/e2e-statefulset-500 pod/ss-0 node/ci-op-jyv2v8ft-694a5-zcv8h-worker-0-6w2n6 reason/Failed (NodePorts): Pod Predicate NodePorts failed
Sep 19 20:55:46.279 E ns/e2e-statefulset-500 pod/ss-0 node/ci-op-jyv2v8ft-694a5-zcv8h-worker-0-6w2n6 reason/Failed (NodePorts): Pod Predicate NodePorts failed
Sep 19 20:55:46.332 E ns/e2e-statefulset-500 pod/ss-0 node/ci-op-jyv2v8ft-694a5-zcv8h-worker-0-6w2n6 reason/Failed (NodePorts): Pod Predicate NodePorts failed
Sep 19 20:55:46.423 E ns/e2e-statefulset-500 pod/ss-0 node/ci-op-jyv2v8ft-694a5-zcv8h-worker-0-6w2n6 reason/Failed (NodePorts): Pod Predicate NodePorts failed
Sep 19 20:55:46.592 E ns/e2e-statefulset-500 pod/ss-0 node/ci-op-jyv2v8ft-694a5-zcv8h-worker-0-6w2n6 reason/Failed (NodePorts): Pod Predicate NodePorts failed
Sep 19 20:55:46.691 E ns/e2e-statefulset-500 pod/ss-0 node/ci-op-jyv2v8ft-694a5-zcv8h-worker-0-6w2n6 reason/Failed (NodePorts): Pod Predicate NodePorts failed
Sep 19 20:55:46.761 E ns/e2e-statefulset-500 pod/ss-0 node/ci-op-jyv2v8ft-694a5-zcv8h-worker-0-6w2n6 reason/Failed (NodePorts): Pod Predicate NodePorts failed
Sep 19 20:55:46.855 E ns/e2e-statefulset-500 pod/ss-0 node/ci-op-jyv2v8ft-694a5-zcv8h-worker-0-6w2n6 reason/Failed (NodePorts): Pod Predicate NodePorts failed
Sep 19 20:55:46.976 E ns/e2e-statefulset-500 pod/ss-0 node/ci-op-jyv2v8ft-694a5-zcv8h-worker-0-6w2n6 reason/Failed (NodePorts): Pod Predicate NodePorts failed
Sep 19 20:55:47.046 E ns/e2e-statefulset-500 pod/ss-0 node/ci-op-jyv2v8ft-694a5-zcv8h-worker-0-6w2n6 reason/Failed (NodePorts): Pod Predicate NodePorts failed
Sep 19 20:55:47.119 E ns/e2e-statefulset-500 pod/ss-0 node/ci-op-jyv2v8ft-694a5-zcv8h-worker-0-6w2n6 reason/Failed (NodePorts): Pod Predicate NodePorts failed
Sep 19 20:55:47.217 E ns/e2e-statefulset-500 pod/ss-0 node/ci-op-jyv2v8ft-694a5-zcv8h-worker-0-6w2n6 reason/Failed (NodePorts): Pod Predicate NodePorts failed
Sep 19 20:55:47.333 E ns/e2e-statefulset-500 pod/ss-0 node/ci-op-jyv2v8ft-694a5-zcv8h-worker-0-6w2n6 reason/Failed (NodePorts): Pod Predicate NodePorts failed
Sep 19 20:55:47.405 E ns/e2e-statefulset-500 pod/ss-0 node/ci-op-jyv2v8ft-694a5-zcv8h-worker-0-6w2n6 reason/Failed (NodePorts): Pod Predicate NodePorts failed
Sep 19 20:55:47.528 E ns/e2e-statefulset-500 pod/ss-0 node/ci-op-jyv2v8ft-694a5-zcv8h-worker-0-6w2n6 reason/Failed (NodePorts): Pod Predicate NodePorts failed
Sep 19 20:55:47.575 E ns/e2e-statefulset-500 pod/ss-0 node/ci-op-jyv2v8ft-694a5-zcv8h-worker-0-6w2n6 reason/Failed (NodePorts): Pod Predicate NodePorts failed
Sep 19 20:55:47.693 E ns/e2e-statefulset-500 pod/ss-0 node/ci-op-jyv2v8ft-694a5-zcv8h-worker-0-6w2n6 reason/Failed (NodePorts): Pod Predicate NodePorts failed
Sep 19 20:55:47.750 E ns/e2e-statefulset-500 pod/ss-0 node/ci-op-jyv2v8ft-694a5-zcv8h-worker-0-6w2n6 reason/Failed (NodePorts): Pod Predicate NodePorts failed
Sep 19 20:55:47.819 E ns/e2e-statefulset-500 pod/ss-0 node/ci-op-jyv2v8ft-694a5-zcv8h-worker-0-6w2n6 reason/Failed (NodePorts): Pod Predicate NodePorts failed
Sep 19 20:55:47.913 E ns/e2e-statefulset-500 pod/ss-0 node/ci-op-jyv2v8ft-694a5-zcv8h-worker-0-6w2n6 reason/Failed (NodePorts): Pod Predicate NodePorts failed
Sep 19 20:55:47.999 E ns/e2e-statefulset-500 pod/ss-0 node/ci-op-jyv2v8ft-694a5-zcv8h-worker-0-6w2n6 reason/Failed (NodePorts): Pod Predicate NodePorts failed
Sep 19 20:55:48.105 E ns/e2e-statefulset-500 pod/ss-0 node/ci-op-jyv2v8ft-694a5-zcv8h-worker-0-6w2n6 reason/Failed (NodePorts): Pod Predicate NodePorts failed
Sep 19 20:55:48.168 E ns/e2e-statefulset-500 pod/ss-0 node/ci-op-jyv2v8ft-694a5-zcv8h-worker-0-6w2n6 reason/Failed (NodePorts): Pod Predicate NodePorts failed
Sep 19 20:55:48.234 E ns/e2e-statefulset-500 pod/ss-0 node/ci-op-jyv2v8ft-694a5-zcv8h-worker-0-6w2n6 reason/Failed (NodePorts): Pod Predicate NodePorts failed
Sep 19 20:55:48.397 E ns/e2e-statefulset-500 pod/ss-0 node/ci-op-jyv2v8ft-694a5-zcv8h-worker-0-6w2n6 reason/Failed (NodePorts): Pod Predicate NodePorts failed
Sep 19 20:55:48.470 E ns/e2e-statefulset-500 pod/ss-0 node/ci-op-jyv2v8ft-694a5-zcv8h-worker-0-6w2n6 reason/Failed (NodePorts): Pod Predicate NodePorts failed
Sep 19 20:55:48.872 E ns/e2e-statefulset-500 pod/ss-0 node/ci-op-jyv2v8ft-694a5-zcv8h-worker-0-6w2n6 reason/Failed (NodePorts): Pod Predicate NodePorts failed
Sep 19 20:55:48.941 E ns/e2e-statefulset-500 pod/ss-0 node/ci-op-jyv2v8ft-694a5-zcv8h-worker-0-6w2n6 reason/Failed (NodePorts): Pod Predicate NodePorts failed
Sep 19 20:55:49.044 E ns/e2e-statefulset-500 pod/ss-0 node/ci-op-jyv2v8ft-694a5-zcv8h-worker-0-6w2n6 reason/Failed (NodePorts): Pod Predicate NodePorts failed
Sep 19 20:55:49.142 E ns/e2e-statefulset-500 pod/ss-0 node/ci-op-jyv2v8ft-694a5-zcv8h-worker-0-6w2n6 reason/Failed (NodePorts): Pod Predicate NodePorts failed
Sep 19 20:55:49.259 E ns/e2e-statefulset-500 pod/ss-0 node/ci-op-jyv2v8ft-694a5-zcv8h-worker-0-6w2n6 reason/Failed (NodePorts): Pod Predicate NodePorts failed
Sep 19 20:55:49.324 E ns/e2e-statefulset-500 pod/ss-0 node/ci-op-jyv2v8ft-694a5-zcv8h-worker-0-6w2n6 reason/Failed (NodePorts): Pod Predicate NodePorts failed
Sep 19 20:55:49.415 E ns/e2e-statefulset-500 pod/ss-0 node/ci-op-jyv2v8ft-694a5-zcv8h-worker-0-6w2n6 reason/Failed (NodePorts): Pod Predicate NodePorts failed
Sep 19 20:55:49.496 E ns/e2e-statefulset-500 pod/ss-0 node/ci-op-jyv2v8ft-694a5-zcv8h-worker-0-6w2n6 reason/Failed (NodePorts): Pod Predicate NodePorts failed
Sep 19 20:55:49.879 E ns/e2e-statefulset-500 pod/test-pod node/ci-op-jyv2v8ft-694a5-zcv8h-worker-0-6w2n6 container/webserver container exited with code 1 (Error): 
Sep 19 20:55:49.893 E ns/e2e-statefulset-500 pod/ss-0 node/ci-op-jyv2v8ft-694a5-zcv8h-worker-0-6w2n6 reason/Failed (NodePorts): Pod Predicate NodePorts failed
Sep 19 20:55:49.974 E ns/e2e-statefulset-500 pod/ss-0 node/ci-op-jyv2v8ft-694a5-zcv8h-worker-0-6w2n6 reason/Failed (NodePorts): Pod Predicate NodePorts failed
Sep 19 20:55:50.027 E ns/e2e-statefulset-500 pod/ss-0 node/ci-op-jyv2v8ft-694a5-zcv8h-worker-0-6w2n6 reason/Failed (NodePorts): Pod Predicate NodePorts failed
Sep 19 20:55:50.102 E ns/e2e-statefulset-500 pod/ss-0 node/ci-op-jyv2v8ft-694a5-zcv8h-worker-0-6w2n6 reason/Failed (NodePorts): Pod Predicate NodePorts failed
Sep 19 20:55:50.163 E ns/e2e-statefulset-500 pod/ss-0 node/ci-op-jyv2v8ft-694a5-zcv8h-worker-0-6w2n6 reason/Failed (NodePorts): Pod Predicate NodePorts failed
Sep 19 20:55:50.248 E ns/e2e-statefulset-500 pod/ss-0 node/ci-op-jyv2v8ft-694a5-zcv8h-worker-0-6w2n6 reason/Failed (NodePorts): Pod Predicate NodePorts failed
Sep 19 20:56:11.397 E ns/openshift-marketplace pod/community-operators-pc8fk node/ci-op-jyv2v8ft-694a5-zcv8h-worker-0-xccxs container/registry-server container exited with code 1 (Error): 
Sep 19 20:56:21.758 E ns/e2e-tables-8062 pod/pod-1 node/ci-op-jyv2v8ft-694a5-zcv8h-worker-0-6w2n6 container/pod-1-container init container exited with code 2 (Error): 
Sep 19 20:56:21.758 E ns/e2e-tables-8062 pod/pod-1 node/ci-op-jyv2v8ft-694a5-zcv8h-worker-0-6w2n6 reason/Failed (): 
Sep 19 20:56:21.758 E ns/e2e-tables-8062 pod/pod-1 node/ci-op-jyv2v8ft-694a5-zcv8h-worker-0-6w2n6 container/pod-1-container container exited with code 2 (Error): 
Sep 19 20:56:30.465 E ns/e2e-svcaccounts-7649 pod/pod-service-account-mountsa-nomountspec node/ci-op-jyv2v8ft-694a5-zcv8h-worker-0-xccxs container/token-test init container exited with code 2 (Error): 
Sep 19 20:56:30.465 E ns/e2e-svcaccounts-7649 pod/pod-service-account-mountsa-nomountspec node/ci-op-jyv2v8ft-694a5-zcv8h-worker-0-xccxs reason/Failed (): 
Sep 19 20:56:30.465 E ns/e2e-svcaccounts-7649 pod/pod-service-account-mountsa-nomountspec node/ci-op-jyv2v8ft-694a5-zcv8h-worker-0-xccxs container/token-test container exited with code 2 (Error): 
Sep 19 20:56:40.345 E ns/e2e-svcaccounts-7649 pod/pod-service-account-nomountsa-mountspec node/ci-op-jyv2v8ft-694a5-zcv8h-worker-0-xccxs container/token-test init container exited with code 2 (Error): 
Sep 19 20:56:40.345 E ns/e2e-svcaccounts-7649 pod/pod-service-account-nomountsa-mountspec node/ci-op-jyv2v8ft-694a5-zcv8h-worker-0-xccxs reason/Failed (): 
Sep 19 20:56:40.345 E ns/e2e-svcaccounts-7649 pod/pod-service-account-nomountsa-mountspec node/ci-op-jyv2v8ft-694a5-zcv8h-worker-0-xccxs container/token-test container exited with code 2 (Error): 
Sep 19 20:56:41.317 E ns/e2e-svcaccounts-7649 pod/pod-service-account-defaultsa-nomountspec node/ci-op-jyv2v8ft-694a5-zcv8h-worker-0-xccxs container/token-test init container exited with code 2 (Error): 
Sep 19 20:56:41.317 E ns/e2e-svcaccounts-7649 pod/pod-service-account-defaultsa-nomountspec node/ci-op-jyv2v8ft-694a5-zcv8h-worker-0-xccxs reason/Failed (): 
Sep 19 20:56:41.317 E ns/e2e-svcaccounts-7649 pod/pod-service-account-defaultsa-nomountspec node/ci-op-jyv2v8ft-694a5-zcv8h-worker-0-xccxs container/token-test container exited with code 2 (Error): 
Sep 19 20:56:45.419 E ns/e2e-svcaccounts-7649 pod/pod-service-account-nomountsa-nomountspec node/ci-op-jyv2v8ft-694a5-zcv8h-worker-0-xccxs container/token-test init container exited with code 2 (Error): 
Sep 19 20:56:45.419 E ns/e2e-svcaccounts-7649 pod/pod-service-account-nomountsa-nomountspec node/ci-op-jyv2v8ft-694a5-zcv8h-worker-0-xccxs reason/Failed (): 
Sep 19 20:56:45.419 E ns/e2e-svcaccounts-7649 pod/pod-service-account-nomountsa-nomountspec node/ci-op-jyv2v8ft-694a5-zcv8h-worker-0-xccxs container/token-test container exited with code 2 (Error): 
Sep 19 20:56:51.970 E ns/e2e-test-router-stress-5rpnh pod/execpod node/ci-op-jyv2v8ft-694a5-zcv8h-worker-0-6w2n6 container/hostexec container exited with code 137 (Error): 
Sep 19 20:56:54.986 E ns/e2e-net-isolation1-5138 pod/isolation-webserver node/ci-op-jyv2v8ft-694a5-zcv8h-worker-0-6w2n6 container/isolation-webserver-container init container exited with code 2 (Error): 
Sep 19 20:56:54.986 E ns/e2e-net-isolation1-5138 pod/isolation-webserver node/ci-op-jyv2v8ft-694a5-zcv8h-worker-0-6w2n6 reason/Failed (): 
Sep 19 20:56:54.986 E ns/e2e-net-isolation1-5138 pod/isolation-webserver node/ci-op-jyv2v8ft-694a5-zcv8h-worker-0-6w2n6 container/isolation-webserver-container container exited with code 2 (Error): 
Sep 19 20:56:57.049 E ns/e2e-test-prometheus-bgmtw pod/execpodcgkxt node/ci-op-jyv2v8ft-694a5-zcv8h-worker-0-6w2n6 container/agnhost-pause container exited with code 137 (Error): 
Sep 19 20:57:03.030 E ns/e2e-provisioning-1518 pod/pod-subpath-test-inlinevolume-zhdk node/ci-op-jyv2v8ft-694a5-zcv8h-worker-0-6w2n6 container/test-container-volume-inlinevolume-zhdk init container exited with code 137 (Error): 
Sep 19 20:57:03.030 E ns/e2e-provisioning-1518 pod/pod-subpath-test-inlinevolume-zhdk node/ci-op-jyv2v8ft-694a5-zcv8h-worker-0-6w2n6 reason/Failed (): 
Sep 19 20:57:03.030 E ns/e2e-provisioning-1518 pod/pod-subpath-test-inlinevolume-zhdk node/ci-op-jyv2v8ft-694a5-zcv8h-worker-0-6w2n6 container/test-container-volume-inlinevolume-zhdk container exited with code 137 (Error): 
Sep 19 20:57:24.110 E ns/openshift-marketplace pod/community-operators-2sgjw node/ci-op-jyv2v8ft-694a5-zcv8h-worker-0-6w2n6 container/registry-server container exited with code 1 (Error): 
Sep 19 20:57:52.458 E ns/e2e-sctp-1875 pod/pod1 node/ci-op-jyv2v8ft-694a5-zcv8h-worker-0-6w2n6 container/pause container exited with code 2 (Error): 
Sep 19 20:58:22.119 E ns/e2e-snapshotting-9006-8584 pod/csi-hostpathplugin-0 node/ci-op-jyv2v8ft-694a5-zcv8h-worker-0-xccxs container/liveness-probe container exited with code 2 (Error): 
Sep 19 20:58:22.119 E ns/e2e-snapshotting-9006-8584 pod/csi-hostpathplugin-0 node/ci-op-jyv2v8ft-694a5-zcv8h-worker-0-xccxs container/node-driver-registrar container exited with code 2 (Error): 
Sep 19 20:58:22.150 E ns/e2e-snapshotting-9006-8584 pod/csi-hostpath-provisioner-0 node/ci-op-jyv2v8ft-694a5-zcv8h-worker-0-xccxs container/csi-provisioner container exited with code 2 (Error): 
Sep 19 20:58:28.743 E ns/e2e-volume-686 pod/local-client node/ci-op-jyv2v8ft-694a5-zcv8h-worker-0-6w2n6 container/local-client container exited with code 137 (Error): 
Sep 19 20:58:37.374 E ns/e2e-test-build-webhooks-hpps6 pod/pushbuild-1-build node/ci-op-jyv2v8ft-694a5-zcv8h-worker-0-xccxs container/git-clone container exited with code 1 (Error): Cloning "http://my.docker/build" ...\nerror: fatal: unable to access 'http://my.docker/build/': Could not resolve host: my.docker\n
Sep 19 20:58:37.374 E ns/e2e-test-build-webhooks-hpps6 pod/pushbuild-1-build node/ci-op-jyv2v8ft-694a5-zcv8h-worker-0-xccxs reason/Failed (): 
Sep 19 20:58:37.374 E ns/e2e-test-build-webhooks-hpps6 pod/pushbuild-1-build node/ci-op-jyv2v8ft-694a5-zcv8h-worker-0-xccxs container/git-clone init container exited with code 1 (Error): Cloning "http://my.docker/build" ...\nerror: fatal: unable to access 'http://my.docker/build/': Could not resolve host: my.docker\n
Sep 19 20:58:48.870 E ns/e2e-pods-9892 pod/pod-exec-websocket-e49f49fc-684e-4697-bda2-fc097ee4c9ef node/ci-op-jyv2v8ft-694a5-zcv8h-worker-0-6w2n6 container/main container exited with code 137 (Error): 
Sep 19 21:02:33.403 E ns/openshift-marketplace pod/community-operators-2sgjw node/ci-op-jyv2v8ft-694a5-zcv8h-worker-0-6w2n6 container/registry-server container exited with code 1 (Error): 
Sep 19 21:02:39.456 E ns/e2e-provisioning-2048-9386 pod/csi-hostpath-resizer-0 node/ci-op-jyv2v8ft-694a5-zcv8h-worker-0-6w2n6 container/csi-resizer container exited with code 2 (Error): 
Sep 19 21:02:39.528 E ns/e2e-provisioning-2048-9386 pod/csi-hostpath-provisioner-0 node/ci-op-jyv2v8ft-694a5-zcv8h-worker-0-6w2n6 container/csi-provisioner container exited with code 2 (Error): 
Sep 19 21:02:39.580 E ns/e2e-provisioning-2048-9386 pod/csi-hostpathplugin-0 node/ci-op-jyv2v8ft-694a5-zcv8h-worker-0-6w2n6 container/node-driver-registrar container exited with code 2 (Error): 
Sep 19 21:02:39.580 E ns/e2e-provisioning-2048-9386 pod/csi-hostpathplugin-0 node/ci-op-jyv2v8ft-694a5-zcv8h-worker-0-6w2n6 container/liveness-probe container exited with code 2 (Error): 
Sep 19 21:03:37.644 E ns/e2e-provisioning-7848-4528 pod/csi-hostpathplugin-0 node/ci-op-jyv2v8ft-694a5-zcv8h-worker-0-6w2n6 container/node-driver-registrar container exited with code 2 (Error): 
Sep 19 21:03:37.644 E ns/e2e-provisioning-7848-4528 pod/csi-hostpathplugin-0 node/ci-op-jyv2v8ft-694a5-zcv8h-worker-0-6w2n6 container/liveness-probe container exited with code 2 (Error): 
Sep 19 21:03:56.740 E ns/e2e-provisioning-7671 pod/pod-subpath-test-preprovisionedpv-v4x2 node/ci-op-jyv2v8ft-694a5-zcv8h-worker-0-6w2n6 container/test-container-volume-preprovisionedpv-v4x2 init container exited with code 137 (Error): 
Sep 19 21:03:56.740 E ns/e2e-provisioning-7671 pod/pod-subpath-test-preprovisionedpv-v4x2 node/ci-op-jyv2v8ft-694a5-zcv8h-worker-0-6w2n6 reason/Failed (): 
Sep 19 21:03:56.740 E ns/e2e-provisioning-7671 pod/pod-subpath-test-preprovisionedpv-v4x2 node/ci-op-jyv2v8ft-694a5-zcv8h-worker-0-6w2n6 container/test-container-volume-preprovisionedpv-v4x2 container exited with code 137 (Error): 
Sep 19 21:04:34.861 E ns/e2e-network-policy-5925 pod/client-a-zxl7t node/ci-op-jyv2v8ft-694a5-zcv8h-worker-0-6w2n6 container/client init container exited with code 1 (Error): 
Sep 19 21:04:34.861 E ns/e2e-network-policy-5925 pod/client-a-zxl7t node/ci-op-jyv2v8ft-694a5-zcv8h-worker-0-6w2n6 reason/Failed (): 
Sep 19 21:04:34.861 E ns/e2e-network-policy-5925 pod/client-a-zxl7t node/ci-op-jyv2v8ft-694a5-zcv8h-worker-0-6w2n6 container/client container exited with code 1 (Error): 
Sep 19 21:05:14.531 E clusteroperator/monitoring changed Degraded to True: UpdatingAlertmanagerFailed: Failed to rollout the stack. Error: running task Updating Alertmanager failed: waiting for Alertmanager object changes failed: waiting for Alertmanager openshift-monitoring/main: expected 3 replicas, got 0 updated replicas
Sep 19 21:05:20.530 E ns/e2e-test-image-oc-tag-9dvwg pod/localimage-1-build node/ci-op-jyv2v8ft-694a5-zcv8h-worker-0-6w2n6 container/docker-build init container exited with code 1 (Error): 78d5ce11a88991d1ab6056d8f40\nSTEP 2: RUN touch /test-image\n--> 3e88b353397\nSTEP 3: ENV "OPENSHIFT_BUILD_NAME"="localimage-1" "OPENSHIFT_BUILD_NAMESPACE"="e2e-test-image-oc-tag-9dvwg"\n--> 0fac083652c\nSTEP 4: LABEL "io.openshift.build.name"="localimage-1" "io.openshift.build.namespace"="e2e-test-image-oc-tag-9dvwg"\nSTEP 5: COMMIT temp.builder.openshift.io/e2e-test-image-oc-tag-9dvwg/localimage-1:f7c249c8\n--> c061503dcf6\nc061503dcf6b2f793115ef817d521a829197d00e5966193ae99ca5cabda8c9b7\n\nPushing image image-registry.openshift-image-registry.svc:5000/e2e-test-image-oc-tag-9dvwg/localimage:latest ...\nGetting image source signatures\nSuccessfully pushed image-registry.openshift-image-registry.svc:5000/e2e-test-image-oc-tag-9dvwg/localimage:latest\nWarning: Push failed, retrying in 5s ...\nGetting image source signatures\nSuccessfully pushed image-registry.openshift-image-registry.svc:5000/e2e-test-image-oc-tag-9dvwg/localimage:latest\nWarning: Push failed, retrying in 5s ...\nGetting image source signatures\nSuccessfully pushed image-registry.openshift-image-registry.svc:5000/e2e-test-image-oc-tag-9dvwg/localimage:latest\nWarning: Push failed, retrying in 5s ...\nRegistry server Address: \nRegistry server User Name: serviceaccount\nRegistry server Email: serviceaccount@example.org\nRegistry server Password: <<non-empty>>\nerror: build error: Failed to push image: error copying layers and metadata from "containers-storage:[overlay@/var/lib/containers/storage+/var/run/containers/storage:overlay.imagestore=/var/lib/shared]image-registry.openshift-image-registry.svc:5000/e2e-test-image-oc-tag-9dvwg/localimage:latest" to "docker://image-registry.openshift-image-registry.svc:5000/e2e-test-image-oc-tag-9dvwg/localimage:latest": Error trying to reuse blob sha256:d997fe81ee23c0adf99f8b21421f60113323df5fda7e5aa4066e45adf4136009 at destination: error pinging docker registry image-registry.openshift-image-registry.svc:5000: Get "https://image-registry.openshift-image-registry.svc:5000/v2/": dial tcp 172.30.5.163:5000: connect: connection refused\n
Sep 19 21:05:20.530 E ns/e2e-test-image-oc-tag-9dvwg pod/localimage-1-build node/ci-op-jyv2v8ft-694a5-zcv8h-worker-0-6w2n6 reason/Failed (): 
Sep 19 21:05:20.530 E ns/e2e-test-image-oc-tag-9dvwg pod/localimage-1-build node/ci-op-jyv2v8ft-694a5-zcv8h-worker-0-6w2n6 container/docker-build container exited with code 1 (Error): 78d5ce11a88991d1ab6056d8f40\nSTEP 2: RUN touch /test-image\n--> 3e88b353397\nSTEP 3: ENV "OPENSHIFT_BUILD_NAME"="localimage-1" "OPENSHIFT_BUILD_NAMESPACE"="e2e-test-image-oc-tag-9dvwg"\n--> 0fac083652c\nSTEP 4: LABEL "io.openshift.build.name"="localimage-1" "io.openshift.build.namespace"="e2e-test-image-oc-tag-9dvwg"\nSTEP 5: COMMIT temp.builder.openshift.io/e2e-test-image-oc-tag-9dvwg/localimage-1:f7c249c8\n--> c061503dcf6\nc061503dcf6b2f793115ef817d521a829197d00e5966193ae99ca5cabda8c9b7\n\nPushing image image-registry.openshift-image-registry.svc:5000/e2e-test-image-oc-tag-9dvwg/localimage:latest ...\nGetting image source signatures\nSuccessfully pushed image-registry.openshift-image-registry.svc:5000/e2e-test-image-oc-tag-9dvwg/localimage:latest\nWarning: Push failed, retrying in 5s ...\nGetting image source signatures\nSuccessfully pushed image-registry.openshift-image-registry.svc:5000/e2e-test-image-oc-tag-9dvwg/localimage:latest\nWarning: Push failed, retrying in 5s ...\nGetting image source signatures\nSuccessfully pushed image-registry.openshift-image-registry.svc:5000/e2e-test-image-oc-tag-9dvwg/localimage:latest\nWarning: Push failed, retrying in 5s ...\nRegistry server Address: \nRegistry server User Name: serviceaccount\nRegistry server Email: serviceaccount@example.org\nRegistry server Password: <<non-empty>>\nerror: build error: Failed to push image: error copying layers and metadata from "containers-storage:[overlay@/var/lib/containers/storage+/var/run/containers/storage:overlay.imagestore=/var/lib/shared]image-registry.openshift-image-registry.svc:5000/e2e-test-image-oc-tag-9dvwg/localimage:latest" to "docker://image-registry.openshift-image-registry.svc:5000/e2e-test-image-oc-tag-9dvwg/localimage:latest": Error trying to reuse blob sha256:d997fe81ee23c0adf99f8b21421f60113323df5fda7e5aa4066e45adf4136009 at destination: error pinging docker registry image-registry.openshift-image-registry.svc:5000: Get "https://image-registry.openshift-image-registry.svc:5000/v2/": dial tcp 172.30.5.163:5000: connect: connection refused\n
Sep 19 21:05:52.118 E ns/e2e-port-forwarding-2313 pod/pfpod node/ci-op-jyv2v8ft-694a5-zcv8h-worker-0-6w2n6 container/portforwardtester container exited with code 2 (Error): 
Sep 19 21:05:57.031 E ns/e2e-container-lifecycle-hook-5433 pod/pod-handle-http-request node/ci-op-jyv2v8ft-694a5-zcv8h-worker-0-6w2n6 container/pod-handle-http-request container exited with code 2 (Error): 
Sep 19 21:07:04.206 E ns/e2e-provisioning-4858-3192 pod/csi-hostpathplugin-0 node/ci-op-jyv2v8ft-694a5-zcv8h-worker-0-xccxs container/node-driver-registrar container exited with code 137 (Error): 
Sep 19 21:07:04.206 E ns/e2e-provisioning-4858-3192 pod/csi-hostpathplugin-0 node/ci-op-jyv2v8ft-694a5-zcv8h-worker-0-xccxs container/liveness-probe container exited with code 137 (Error): 
Sep 19 21:07:04.280 E ns/e2e-network-policy-5925 pod/server-cwvcp node/ci-op-jyv2v8ft-694a5-zcv8h-worker-0-xccxs container/server-container-81 init container exited with code 137 (Error): 
Sep 19 21:07:04.280 E ns/e2e-network-policy-5925 pod/server-cwvcp node/ci-op-jyv2v8ft-694a5-zcv8h-worker-0-xccxs container/server-container-80 init container exited with code 137 (Error): 
Sep 19 21:07:04.280 E ns/e2e-network-policy-5925 pod/server-cwvcp node/ci-op-jyv2v8ft-694a5-zcv8h-worker-0-xccxs reason/Failed (): 
Sep 19 21:07:04.280 E ns/e2e-network-policy-5925 pod/server-cwvcp node/ci-op-jyv2v8ft-694a5-zcv8h-worker-0-xccxs container/server-container-81 container exited with code 137 (Error): 
Sep 19 21:07:04.280 E ns/e2e-network-policy-5925 pod/server-cwvcp node/ci-op-jyv2v8ft-694a5-zcv8h-worker-0-xccxs container/server-container-80 container exited with code 137 (Error): 
Sep 19 21:07:46.403 E ns/openshift-marketplace pod/community-operators-2sgjw node/ci-op-jyv2v8ft-694a5-zcv8h-worker-0-6w2n6 container/registry-server container exited with code 1 (Error): 
Sep 19 21:07:46.995 E ns/e2e-provisioning-4858-3192 pod/csi-hostpath-provisioner-0 node/ci-op-jyv2v8ft-694a5-zcv8h-worker-0-xccxs container/csi-provisioner container exited with code 137 (Error): 
Sep 19 21:07:47.059 E ns/openshift-marketplace pod/certified-operators-fkdpw node/ci-op-jyv2v8ft-694a5-zcv8h-worker-0-xccxs container/registry-server container exited with code 137 (Error): 
Sep 19 21:07:47.059 E ns/e2e-network-policy-5925 pod/client-a-6qksb node/ci-op-jyv2v8ft-694a5-zcv8h-worker-0-xccxs container/client init container exited with code 1 (Error): 
Sep 19 21:07:47.059 E ns/e2e-network-policy-5925 pod/client-a-6qksb node/ci-op-jyv2v8ft-694a5-zcv8h-worker-0-xccxs reason/Failed (): 
Sep 19 21:07:47.059 E ns/e2e-network-policy-5925 pod/client-a-6qksb node/ci-op-jyv2v8ft-694a5-zcv8h-worker-0-xccxs container/client container exited with code 1 (Error): 
Sep 19 21:07:47.065 E ns/openshift-marketplace pod/redhat-marketplace-stqpp node/ci-op-jyv2v8ft-694a5-zcv8h-worker-0-xccxs container/registry-server container exited with code 137 (Error): 
Sep 19 21:07:47.136 E ns/e2e-provisioning-4858-3192 pod/csi-hostpath-snapshotter-0 node/ci-op-jyv2v8ft-694a5-zcv8h-worker-0-xccxs container/csi-snapshotter container exited with code 137 (Error): 
Sep 19 21:07:47.146 E ns/e2e-provisioning-4858-3192 pod/csi-hostpath-attacher-0 node/ci-op-jyv2v8ft-694a5-zcv8h-worker-0-xccxs container/csi-attacher container exited with code 137 (Error): 
Sep 19 21:07:48.143 E ns/openshift-marketplace pod/redhat-operators-cs4hn node/ci-op-jyv2v8ft-694a5-zcv8h-worker-0-xccxs container/registry-server container exited with code 137 (Error): 
Sep 19 21:07:48.218 E ns/openshift-kube-storage-version-migrator pod/migrator-7744f9f647-lrhln node/ci-op-jyv2v8ft-694a5-zcv8h-worker-0-xccxs container/migrator container exited with code 137 (Error): I0919 20:39:46.478942       1 migrator.go:18] FLAG: --add_dir_header="false"\nI0919 20:39:46.479041       1 migrator.go:18] FLAG: --alsologtostderr="true"\nI0919 20:39:46.479046       1 migrator.go:18] FLAG: --kube-api-burst="1000"\nI0919 20:39:46.479053       1 migrator.go:18] FLAG: --kube-api-qps="40"\nI0919 20:39:46.479059       1 migrator.go:18] FLAG: --kubeconfig=""\nI0919 20:39:46.479065       1 migrator.go:18] FLAG: --log_backtrace_at=":0"\nI0919 20:39:46.479083       1 migrator.go:18] FLAG: --log_dir=""\nI0919 20:39:46.479088       1 migrator.go:18] FLAG: --log_file=""\nI0919 20:39:46.479092       1 migrator.go:18] FLAG: --log_file_max_size="1800"\nI0919 20:39:46.479097       1 migrator.go:18] FLAG: --logtostderr="true"\nI0919 20:39:46.479101       1 migrator.go:18] FLAG: --skip_headers="false"\nI0919 20:39:46.479105       1 migrator.go:18] FLAG: --skip_log_headers="false"\nI0919 20:39:46.479109       1 migrator.go:18] FLAG: --stderrthreshold="2"\nI0919 20:39:46.479114       1 migrator.go:18] FLAG: --v="2"\nI0919 20:39:46.479118       1 migrator.go:18] FLAG: --vmodule=""\nI0919 20:39:46.480818       1 reflector.go:175] Starting reflector *v1alpha1.StorageVersionMigration (0s) from k8s.io/client-go@v0.18.0-beta.2/tools/cache/reflector.go:125\nI0919 20:47:39.973331       1 streamwatcher.go:114] Unexpected EOF during watch stream event decoding: unexpected EOF\n
Sep 19 21:07:48.303 E ns/openshift-multus pod/network-metrics-daemon-sdgvv node/ci-op-jyv2v8ft-694a5-zcv8h-worker-0-xccxs container/network-metrics-daemon container exited with code 137 (Error): 
Sep 19 21:07:48.303 E ns/openshift-multus pod/network-metrics-daemon-sdgvv node/ci-op-jyv2v8ft-694a5-zcv8h-worker-0-xccxs container/kube-rbac-proxy container exited with code 137 (Error): I0919 20:39:47.444704       1 main.go:188] Valid token audiences: \nI0919 20:39:47.444843       1 main.go:261] Reading certificate files\nI0919 20:39:47.445096       1 main.go:294] Starting TCP socket on :8443\nI0919 20:39:47.445867       1 main.go:301] Listening securely on :8443\n2020/09/19 21:00:07 http: proxy error: context canceled\n2020/09/19 21:00:07 http: proxy error: context canceled\n
Sep 19 21:07:48.370 E ns/e2e-provisioning-4858-3192 pod/csi-hostpath-resizer-0 node/ci-op-jyv2v8ft-694a5-zcv8h-worker-0-xccxs container/csi-resizer container exited with code 137 (Error): 
Sep 19 21:07:59.615 E ns/openshift-monitoring pod/grafana-7f569dd9df-hn6c6 node/ci-op-jyv2v8ft-694a5-zcv8h-worker-0-xccxs container/grafana-proxy container exited with code 2 (Error): 
Sep 19 21:07:59.648 E ns/openshift-monitoring pod/thanos-querier-d4578fd5d-qrjqz node/ci-op-jyv2v8ft-694a5-zcv8h-worker-0-xccxs container/oauth-proxy container exited with code 2 (Error): .0.13:9091->10.128.2.1:41658: write: connection reset by peer\n2020/09/19 21:03:23 server.go:3090: http: TLS handshake error from 10.131.0.1:46220: write tcp 10.131.0.13:9091->10.131.0.1:46220: write: connection reset by peer\n2020/09/19 21:03:23 server.go:3090: http: TLS handshake error from 10.128.2.1:41524: EOF\n2020/09/19 21:03:23 server.go:3090: http: TLS handshake error from 10.131.0.1:46286: write tcp 10.131.0.13:9091->10.131.0.1:46286: write: connection reset by peer\n2020/09/19 21:03:23 server.go:3090: http: TLS handshake error from 10.128.2.1:41374: write tcp 10.131.0.13:9091->10.128.2.1:41374: write: connection reset by peer\n2020/09/19 21:03:59 server.go:3090: http: TLS handshake error from 10.128.2.1:42056: EOF\n2020/09/19 21:03:59 server.go:3090: http: TLS handshake error from 10.128.2.1:42120: write tcp 10.131.0.13:9091->10.128.2.1:42120: write: connection reset by peer\n2020/09/19 21:03:59 server.go:3090: http: TLS handshake error from 10.131.0.1:46394: write tcp 10.131.0.13:9091->10.131.0.1:46394: write: connection reset by peer\n2020/09/19 21:04:18 server.go:3090: http: TLS handshake error from 10.128.2.1:42210: write tcp 10.131.0.13:9091->10.128.2.1:42210: write: connection reset by peer\n2020/09/19 21:04:18 server.go:3090: http: TLS handshake error from 10.128.2.1:42410: write tcp 10.131.0.13:9091->10.128.2.1:42410: write: connection reset by peer\n2020/09/19 21:04:41 server.go:3090: http: TLS handshake error from 10.128.2.1:42708: EOF\n2020/09/19 21:05:44 server.go:3090: http: TLS handshake error from 10.128.2.1:43056: write tcp 10.131.0.13:9091->10.128.2.1:43056: write: connection reset by peer\n2020/09/19 21:05:44 server.go:3090: http: TLS handshake error from 10.131.0.1:47102: write tcp 10.131.0.13:9091->10.131.0.1:47102: write: connection reset by peer\n2020/09/19 21:05:44 server.go:3090: http: TLS handshake error from 10.128.2.1:42948: write tcp 10.131.0.13:9091->10.128.2.1:42948: write: connection reset by peer\n2020/09/19 21:05:45 server.go:3090: http: TLS handshake error from 10.128.2.1:43230: EOF\n
Sep 19 21:08:01.861 E ns/openshift-monitoring pod/alertmanager-main-0 node/ci-op-jyv2v8ft-694a5-zcv8h-worker-0-xccxs container/alertmanager-proxy container exited with code 2 (Error):  read tcp 10.131.0.18:9095->10.131.0.1:45274: read: connection reset by peer\n2020/09/19 21:03:10 server.go:3090: http: TLS handshake error from 10.128.2.1:34042: write tcp 10.131.0.18:9095->10.128.2.1:34042: write: connection reset by peer\n2020/09/19 21:03:10 server.go:3090: http: TLS handshake error from 10.128.2.1:34130: write tcp 10.131.0.18:9095->10.128.2.1:34130: write: connection reset by peer\n2020/09/19 21:04:07 server.go:3090: http: TLS handshake error from 10.128.2.1:34596: write tcp 10.131.0.18:9095->10.128.2.1:34596: write: connection reset by peer\n2020/09/19 21:04:07 server.go:3090: http: TLS handshake error from 10.128.2.1:34522: EOF\n2020/09/19 21:04:07 server.go:3090: http: TLS handshake error from 10.131.0.1:45398: write tcp 10.131.0.18:9095->10.131.0.1:45398: write: connection reset by peer\n2020/09/19 21:04:07 server.go:3090: http: TLS handshake error from 10.128.2.1:34784: write tcp 10.131.0.18:9095->10.128.2.1:34784: write: connection reset by peer\n2020/09/19 21:04:07 server.go:3090: http: TLS handshake error from 10.128.2.1:34684: write tcp 10.131.0.18:9095->10.128.2.1:34684: write: connection reset by peer\n2020/09/19 21:04:07 server.go:3090: http: TLS handshake error from 10.128.2.1:34428: write tcp 10.131.0.18:9095->10.128.2.1:34428: write: connection reset by peer\n2020/09/19 21:04:19 server.go:3090: http: TLS handshake error from 10.128.2.1:34890: write tcp 10.131.0.18:9095->10.128.2.1:34890: write: connection reset by peer\n2020/09/19 21:05:44 server.go:3090: http: TLS handshake error from 10.128.2.1:35644: EOF\n2020/09/19 21:05:44 server.go:3090: http: TLS handshake error from 10.128.2.1:35546: write tcp 10.131.0.18:9095->10.128.2.1:35546: write: connection reset by peer\n2020/09/19 21:05:45 server.go:3090: http: TLS handshake error from 10.131.0.1:46110: write tcp 10.131.0.18:9095->10.131.0.1:46110: write: connection reset by peer\n2020/09/19 21:05:45 server.go:3090: http: TLS handshake error from 10.128.2.1:35438: write tcp 10.131.0.18:9095->10.128.2.1:35438: write: connection reset by peer\n
Sep 19 21:08:01.861 E ns/openshift-monitoring pod/alertmanager-main-0 node/ci-op-jyv2v8ft-694a5-zcv8h-worker-0-xccxs container/config-reloader container exited with code 2 (Error): 2020/09/19 20:40:15 Watching directory: "/etc/alertmanager/config"\n
Sep 19 21:08:01.863 E ns/openshift-monitoring pod/thanos-querier-d4578fd5d-lklr8 node/ci-op-jyv2v8ft-694a5-zcv8h-worker-0-xccxs container/oauth-proxy container exited with code 2 (Error): 1:03:10 server.go:3090: http: TLS handshake error from 10.128.2.1:39196: write tcp 10.131.0.14:9091->10.128.2.1:39196: write: connection reset by peer\n2020/09/19 21:03:10 server.go:3090: http: TLS handshake error from 10.128.2.1:39464: write tcp 10.131.0.14:9091->10.128.2.1:39464: write: connection reset by peer\n2020/09/19 21:03:23 server.go:3090: http: TLS handshake error from 10.131.0.1:39372: write tcp 10.131.0.14:9091->10.131.0.1:39372: write: connection reset by peer\n2020/09/19 21:03:23 server.go:3090: http: TLS handshake error from 10.128.2.1:39594: EOF\n2020/09/19 21:03:23 server.go:3090: http: TLS handshake error from 10.128.2.1:39884: write tcp 10.131.0.14:9091->10.128.2.1:39884: write: connection reset by peer\n2020/09/19 21:03:51 server.go:3090: http: TLS handshake error from 10.128.2.1:40188: write tcp 10.131.0.14:9091->10.128.2.1:40188: write: connection reset by peer\n2020/09/19 21:03:59 server.go:3090: http: TLS handshake error from 10.128.2.1:40280: write tcp 10.131.0.14:9091->10.128.2.1:40280: write: connection reset by peer\n2020/09/19 21:04:07 server.go:3090: http: TLS handshake error from 10.131.0.1:39440: write tcp 10.131.0.14:9091->10.131.0.1:39440: write: connection reset by peer\n2020/09/19 21:04:07 server.go:3090: http: TLS handshake error from 10.128.2.1:40126: EOF\n2020/09/19 21:04:07 server.go:3090: http: TLS handshake error from 10.128.2.1:40056: write tcp 10.131.0.14:9091->10.128.2.1:40056: write: connection reset by peer\n2020/09/19 21:04:18 server.go:3090: http: TLS handshake error from 10.128.2.1:40482: write tcp 10.131.0.14:9091->10.128.2.1:40482: write: connection reset by peer\n2020/09/19 21:05:44 server.go:3090: http: TLS handshake error from 10.128.2.1:41078: write tcp 10.131.0.14:9091->10.128.2.1:41078: write: connection reset by peer\n2020/09/19 21:05:35 server.go:3090: http: TLS handshake error from 10.131.0.1:40152: write tcp 10.131.0.14:9091->10.131.0.1:40152: write: connection reset by peer\n2020/09/19 21:05:44 server.go:3090: http: TLS handshake error from 10.128.2.1:41298: EOF\n
Sep 19 21:08:02.937 E ns/openshift-sdn pod/sdn-tzpps node/ci-op-jyv2v8ft-694a5-zcv8h-worker-0-xccxs container/sdn container exited with code 255 (Error): tpath-snapshotter-0\nI0919 21:07:53.988858    6296 pod.go:541] CNI_DEL e2e-network-policy-5925/client-a-6qksb\nI0919 21:07:54.533562    6296 pod.go:541] CNI_DEL e2e-provisioning-4858-3192/csi-hostpath-attacher-0\nI0919 21:07:54.959870    6296 pod.go:541] CNI_DEL openshift-marketplace/community-operators-pc8fk\nI0919 21:07:55.166601    6296 pod.go:541] CNI_DEL openshift-marketplace/redhat-marketplace-stqpp\nI0919 21:07:55.709004    6296 pod.go:541] CNI_DEL e2e-provisioning-4858-3192/csi-hostpath-provisioner-0\nI0919 21:07:56.133861    6296 pod.go:541] CNI_DEL e2e-provisioning-4858-3192/csi-hostpathplugin-0\nI0919 21:07:56.378958    6296 pod.go:541] CNI_DEL openshift-marketplace/certified-operators-fkdpw\nI0919 21:07:56.621524    6296 pod.go:541] CNI_DEL openshift-marketplace/redhat-operators-cs4hn\nI0919 21:07:56.855527    6296 pod.go:541] CNI_DEL openshift-kube-storage-version-migrator/migrator-7744f9f647-lrhln\nI0919 21:07:57.223303    6296 pod.go:541] CNI_DEL e2e-emptydir-7302/pod-0feb369d-2409-4bc3-86c6-1a1a65158cc3\nI0919 21:07:57.492255    6296 pod.go:541] CNI_DEL e2e-provisioning-4858-3192/csi-hostpath-resizer-0\nI0919 21:07:57.968123    6296 pod.go:505] CNI_ADD e2e-provisioning-896/gluster-server got IP 10.131.0.97, ofport 4\nI0919 21:07:58.682498    6296 pod.go:541] CNI_DEL openshift-monitoring/grafana-7f569dd9df-hn6c6\nI0919 21:07:59.030800    6296 pod.go:541] CNI_DEL openshift-monitoring/thanos-querier-d4578fd5d-qrjqz\nI0919 21:07:59.662034    6296 pod.go:541] CNI_DEL openshift-monitoring/openshift-state-metrics-6f455c9b94-26spz\nI0919 21:07:59.928979    6296 pod.go:541] CNI_DEL openshift-monitoring/alertmanager-main-1\nI0919 21:08:00.708989    6296 pod.go:541] CNI_DEL openshift-monitoring/alertmanager-main-0\nI0919 21:08:00.911464    6296 pod.go:541] CNI_DEL openshift-monitoring/thanos-querier-d4578fd5d-lklr8\nI0919 21:08:01.565806    6296 pod.go:541] CNI_DEL openshift-monitoring/alertmanager-main-2\nF0919 21:08:01.794554    6296 healthcheck.go:99] SDN healthcheck detected unhealthy OVS server, restarting: Link not found\n
Sep 19 21:08:02.967 E ns/openshift-monitoring pod/kube-state-metrics-798dd4fcd4-ls7xc node/ci-op-jyv2v8ft-694a5-zcv8h-worker-0-xccxs container/kube-state-metrics container exited with code 2 (Error): 
Sep 19 21:08:03.077 E ns/openshift-operator-lifecycle-manager pod/catalog-operator-9c59899b8-b77zs node/ci-op-jyv2v8ft-694a5-zcv8h-master-0 container/catalog-operator container exited with code 2 (Error): rpc.go:158 +0x84\ngithub.com/operator-framework/operator-lifecycle-manager/pkg/controller/operators/catalog.(*Operator).syncRegistryServer(0xc000528500, 0xc002978070, 0xc00066c900, 0xc00066c900, 0x1, 0x0, 0x0)\n	/build/pkg/controller/operators/catalog/operator.go:625 +0x28c\ngithub.com/operator-framework/operator-lifecycle-manager/pkg/controller/operators/catalog.(*Operator).syncCatalogSources.func1(0xc00066c900, 0xc002bec060, 0x4, 0x4, 0x1, 0x108806d8, 0x115a6200)\n	/build/pkg/controller/operators/catalog/operator.go:741 +0x78\ngithub.com/operator-framework/operator-lifecycle-manager/pkg/controller/operators/catalog.(*Operator).syncCatalogSources(0xc000528500, 0x11641080, 0xc000031440, 0xc0029f1f10, 0x11749a30)\n	/build/pkg/controller/operators/catalog/operator.go:788 +0x39c\ngithub.com/operator-framework/operator-lifecycle-manager/pkg/lib/queueinformer.LegacySyncHandler.ToSyncerWithDelete.func1(0x119c1c20, 0xc00067e140, 0x1198ec20, 0xc002bec040, 0xc002bec040, 0x114f4c40)\n	/build/pkg/lib/queueinformer/queueinformer.go:183 +0x234\ngithub.com/operator-framework/operator-lifecycle-manager/pkg/lib/kubestate.SyncFunc.Sync(0xc0006f1000, 0x119c1c20, 0xc00067e140, 0x1198ec20, 0xc002bec040, 0xc0029f1d01, 0x0)\n	/build/pkg/lib/kubestate/kubestate.go:184 +0x50\ngithub.com/operator-framework/operator-lifecycle-manager/pkg/lib/queueinformer.(*QueueInformer).Sync(...)\n	/build/pkg/lib/queueinformer/queueinformer.go:36\ngithub.com/operator-framework/operator-lifecycle-manager/pkg/lib/queueinformer.(*operator).processNextWorkItem(0xc00062cc60, 0x119c1c20, 0xc00067e140, 0xc000bac660, 0x0)\n	/build/pkg/lib/queueinformer/queueinformer_operator.go:287 +0x298\ngithub.com/operator-framework/operator-lifecycle-manager/pkg/lib/queueinformer.(*operator).worker(0xc00062cc60, 0x119c1c20, 0xc00067e140, 0xc000bac660)\n	/build/pkg/lib/queueinformer/queueinformer_operator.go:231 +0x44\ncreated by github.com/operator-framework/operator-lifecycle-manager/pkg/lib/queueinformer.(*operator).start\n	/build/pkg/lib/queueinformer/queueinformer_operator.go:221 +0x34c\n
Sep 19 21:08:15.065 E ns/openshift-marketplace pod/community-operators-d5f8l node/ci-op-jyv2v8ft-694a5-zcv8h-worker-0-xccxs container/registry-server container exited with code 1 (Error): 
Sep 19 21:08:26.229 E ns/e2e-test-deployment-trigger-b7hdg pod/config-1-deploy node/ci-op-jyv2v8ft-694a5-zcv8h-worker-0-xccxs container/deployment init container exited with code 1 (Error): 
Sep 19 21:08:26.229 E ns/e2e-test-deployment-trigger-b7hdg pod/config-1-deploy node/ci-op-jyv2v8ft-694a5-zcv8h-worker-0-xccxs reason/Failed (): 
Sep 19 21:08:26.229 E ns/e2e-test-deployment-trigger-b7hdg pod/config-1-deploy node/ci-op-jyv2v8ft-694a5-zcv8h-worker-0-xccxs container/deployment container exited with code 1 (Error): 
Sep 19 21:08:36.535 E ns/openshift-marketplace pod/community-operators-d5f8l node/ci-op-jyv2v8ft-694a5-zcv8h-worker-0-xccxs container/registry-server container exited with code 1 (Error): 
Sep 19 21:08:46.619 E ns/e2e-container-lifecycle-hook-9255 pod/pod-with-prestop-exec-hook node/ci-op-jyv2v8ft-694a5-zcv8h-worker-0-xccxs container/pod-with-prestop-exec-hook container exited with code 2 (Error): 
Sep 19 21:08:48.612 E ns/openshift-multus pod/network-metrics-daemon-sdgvv node/ci-op-jyv2v8ft-694a5-zcv8h-worker-0-xccxs container/network-metrics-daemon container exited with code 255 (Error): 
Sep 19 21:08:49.695 E ns/openshift-monitoring pod/prometheus-k8s-1 node/ci-op-jyv2v8ft-694a5-zcv8h-worker-0-xccxs container/rules-configmap-reloader container exited with code 2 (Error): 2020/09/19 20:40:16 Watching directory: "/etc/prometheus/rules/prometheus-k8s-rulefiles-0"\n2020/09/19 20:41:27 config map updated\n2020/09/19 20:41:27 successfully triggered reload\n2020/09/19 20:52:42 config map updated\n2020/09/19 20:52:42 successfully triggered reload\n
Sep 19 21:08:49.695 E ns/openshift-monitoring pod/prometheus-k8s-1 node/ci-op-jyv2v8ft-694a5-zcv8h-worker-0-xccxs container/prometheus-proxy container exited with code 2 (Error): 2020/09/19 21:03:19 server.go:3090: http: TLS handshake error from 10.131.0.1:53862: write tcp 10.131.0.19:9091->10.131.0.1:53862: write: connection reset by peer\n2020/09/19 21:03:23 server.go:3090: http: TLS handshake error from 10.131.0.1:53892: write tcp 10.131.0.19:9091->10.131.0.1:53892: write: connection reset by peer\n2020/09/19 21:03:24 server.go:3090: http: TLS handshake error from 10.128.2.1:41862: write tcp 10.131.0.19:9091->10.128.2.1:41862: write: connection reset by peer\n2020/09/19 21:03:59 server.go:3090: http: TLS handshake error from 10.131.0.1:53964: write tcp 10.131.0.19:9091->10.131.0.1:53964: write: connection reset by peer\n2020/09/19 21:03:59 server.go:3090: http: TLS handshake error from 10.128.2.1:42076: EOF\n2020/09/19 21:03:59 server.go:3090: http: TLS handshake error from 10.128.2.1:42234: write tcp 10.131.0.19:9091->10.128.2.1:42234: write: connection reset by peer\n2020/09/19 21:03:59 server.go:3090: http: TLS handshake error from 10.128.2.1:42146: write tcp 10.131.0.19:9091->10.128.2.1:42146: write: connection reset by peer\n2020/09/19 21:04:07 server.go:3090: http: TLS handshake error from 10.128.2.1:42334: write tcp 10.131.0.19:9091->10.128.2.1:42334: write: connection reset by peer\n2020/09/19 21:04:18 server.go:3090: http: TLS handshake error from 10.128.2.1:42440: write tcp 10.131.0.19:9091->10.128.2.1:42440: write: connection reset by peer\n2020/09/19 21:04:38 reverseproxy.go:445: http: proxy error: context canceled\n2020/09/19 21:05:43 server.go:3090: http: TLS handshake error from 10.128.2.1:43230: EOF\n2020/09/19 21:05:43 server.go:3090: http: TLS handshake error from 10.128.2.1:43090: write tcp 10.131.0.19:9091->10.128.2.1:43090: write: connection reset by peer\n2020/09/19 21:05:44 server.go:309
Sep 19 21:08:49.695 E ns/openshift-monitoring pod/prometheus-k8s-1 node/ci-op-jyv2v8ft-694a5-zcv8h-worker-0-xccxs container/prometheus-config-reloader container exited with code 2 (Error): ts=2020-09-19T20:40:15.885438041Z caller=main.go:87 msg="Starting prometheus-config-reloader version '1.14'."\nlevel=error ts=2020-09-19T20:40:15.886686719Z caller=runutil.go:98 msg="function failed. Retrying in next tick" err="trigger reload: reload request failed: Post \"http://localhost:9090/-/reload\": dial tcp [::1]:9090: connect: connection refused"\nlevel=info ts=2020-09-19T20:40:21.107564794Z caller=reloader.go:289 msg="Prometheus reload triggered" cfg_in=/etc/prometheus/config/prometheus.yaml.gz cfg_out=/etc/prometheus/config_out/prometheus.env.yaml rule_dirs=\nlevel=info ts=2020-09-19T20:40:21.107622623Z caller=reloader.go:157 msg="started watching config file and non-recursively rule dirs for changes" cfg=/etc/prometheus/config/prometheus.yaml.gz out=/etc/prometheus/config_out/prometheus.env.yaml dirs=\nlevel=info ts=2020-09-19T20:40:21.339879739Z caller=reloader.go:289 msg="Prometheus reload triggered" cfg_in=/etc/prometheus/config/prometheus.yaml.gz cfg_out=/etc/prometheus/config_out/prometheus.env.yaml rule_dirs=\nlevel=info ts=2020-09-19T20:43:21.302900651Z caller=reloader.go:289 msg="Prometheus reload triggered" cfg_in=/etc/prometheus/config/prometheus.yaml.gz cfg_out=/etc/prometheus/config_out/prometheus.env.yaml rule_dirs=\nlevel=info ts=2020-09-19T20:55:21.394153689Z caller=reloader.go:289 msg="Prometheus reload triggered" cfg_in=/etc/prometheus/config/prometheus.yaml.gz cfg_out=/etc/prometheus/config_out/prometheus.env.yaml rule_dirs=\n
Sep 19 21:08:55.922 E ns/e2e-ephemeral-8131-8505 pod/csi-hostpath-attacher-0 node/ci-op-jyv2v8ft-694a5-zcv8h-worker-0-6w2n6 container/csi-attacher container exited with code 2 (Error): 
Sep 19 21:08:56.694 E ns/e2e-pods-9655 pod/pod-submit-remove-b6451fcf-286c-4180-97ec-406f8302e7ab node/ci-op-jyv2v8ft-694a5-zcv8h-worker-0-xccxs container/agnhost container exited with code 2 (Error): 
Sep 19 21:08:57.240 E ns/e2e-ephemeral-8131-8505 pod/csi-hostpath-snapshotter-0 node/ci-op-jyv2v8ft-694a5-zcv8h-worker-0-6w2n6 container/csi-snapshotter container exited with code 2 (Error): 
Sep 19 21:09:00.863 E ns/e2e-job-1505 pod/fail-once-local-4r6dr node/ci-op-jyv2v8ft-694a5-zcv8h-worker-0-xccxs container/c container exited with code 1 (Error): 
Sep 19 21:09:01.874 E ns/e2e-job-1505 pod/fail-once-local-9pdck node/ci-op-jyv2v8ft-694a5-zcv8h-worker-0-xccxs container/c container exited with code 1 (Error): 
Sep 19 21:09:04.965 E ns/openshift-monitoring pod/prometheus-k8s-1 node/ci-op-jyv2v8ft-694a5-zcv8h-worker-0-xccxs container/prometheus container exited with code 2 (Error): level=error ts=2020-09-19T21:09:01.042Z caller=main.go:285 msg="Error loading config (--config.file=/etc/prometheus/config_out/prometheus.env.yaml)" err="open /etc/prometheus/config_out/prometheus.env.yaml: no such file or directory"\n
Sep 19 21:09:06.009 E ns/e2e-job-1505 pod/fail-once-local-m7xdf node/ci-op-jyv2v8ft-694a5-zcv8h-worker-0-xccxs container/c container exited with code 1 (Error): 
Sep 19 21:09:07.001 E ns/e2e-job-1505 pod/fail-once-local-57zz5 node/ci-op-jyv2v8ft-694a5-zcv8h-worker-0-xccxs container/c container exited with code 1 (Error): 
Sep 19 21:09:09.033 E ns/openshift-monitoring pod/prometheus-k8s-0 node/ci-op-jyv2v8ft-694a5-zcv8h-worker-0-6w2n6 container/prometheus container exited with code 2 (Error): level=error ts=2020-09-19T21:09:04.698Z caller=main.go:285 msg="Error loading config (--config.file=/etc/prometheus/config_out/prometheus.env.yaml)" err="open /etc/prometheus/config_out/prometheus.env.yaml: no such file or directory"\n
Sep 19 21:09:15.186 E ns/openshift-marketplace pod/community-operators-d5f8l node/ci-op-jyv2v8ft-694a5-zcv8h-worker-0-xccxs container/registry-server container exited with code 1 (Error): 
Sep 19 21:09:39.376 E ns/e2e-port-forwarding-4278 pod/pfpod node/ci-op-jyv2v8ft-694a5-zcv8h-worker-0-xccxs container/portforwardtester container exited with code 4 (Error): 
Sep 19 21:10:05.781 E ns/openshift-marketplace pod/community-operators-d5f8l node/ci-op-jyv2v8ft-694a5-zcv8h-worker-0-xccxs container/registry-server container exited with code 1 (Error): 
Sep 19 21:10:28.708 E ns/e2e-volumemode-9133-6559 pod/csi-hostpath-provisioner-0 node/ci-op-jyv2v8ft-694a5-zcv8h-worker-0-6w2n6 container/csi-provisioner container exited with code 2 (Error): 
Sep 19 21:10:28.723 E ns/e2e-volumemode-9133-6559 pod/csi-hostpath-resizer-0 node/ci-op-jyv2v8ft-694a5-zcv8h-worker-0-6w2n6 container/csi-resizer container exited with code 2 (Error): 
Sep 19 21:10:28.787 E ns/e2e-volumemode-9133-6559 pod/csi-hostpath-snapshotter-0 node/ci-op-jyv2v8ft-694a5-zcv8h-worker-0-6w2n6 container/csi-snapshotter container exited with code 2 (Error): 
Sep 19 21:10:36.947 E ns/e2e-test-build-webhooks-h9qsl pod/pushbuild-1-build node/ci-op-jyv2v8ft-694a5-zcv8h-worker-0-xccxs container/git-clone container exited with code 1 (Error): Cloning "http://my.docker/build" ...\nerror: fatal: unable to access 'http://my.docker/build/': Could not resolve host: my.docker\n
Sep 19 21:10:36.947 E ns/e2e-test-build-webhooks-h9qsl pod/pushbuild-1-build node/ci-op-jyv2v8ft-694a5-zcv8h-worker-0-xccxs reason/Failed (): 
Sep 19 21:10:36.947 E ns/e2e-test-build-webhooks-h9qsl pod/pushbuild-1-build node/ci-op-jyv2v8ft-694a5-zcv8h-worker-0-xccxs container/git-clone init container exited with code 1 (Error): Cloning "http://my.docker/build" ...\nerror: fatal: unable to access 'http://my.docker/build/': Could not resolve host: my.docker\n
Sep 19 21:10:49.880 E ns/e2e-prestop-2192 pod/server node/ci-op-jyv2v8ft-694a5-zcv8h-worker-0-6w2n6 container/server container exited with code 2 (Error): 
Sep 19 21:11:15.992 E ns/e2e-prestop-2192 pod/tester node/ci-op-jyv2v8ft-694a5-zcv8h-worker-0-6w2n6 container/tester container exited with code 137 (Error): 
Sep 19 21:11:34.324 E ns/openshift-marketplace pod/community-operators-d5f8l node/ci-op-jyv2v8ft-694a5-zcv8h-worker-0-xccxs container/registry-server container exited with code 1 (Error): 
Sep 19 21:11:37.340 E ns/e2e-examples-6400 pod/liveness-exec node/ci-op-jyv2v8ft-694a5-zcv8h-worker-0-xccxs container/liveness-exec container exited with code 137 (Error): 
Sep 19 21:12:01.580 E ns/e2e-csi-mock-volumes-1313-3668 pod/csi-mockplugin-0 node/ci-op-jyv2v8ft-694a5-zcv8h-worker-0-xccxs container/csi-provisioner container exited with code 2 (Error): 
Sep 19 21:12:01.580 E ns/e2e-csi-mock-volumes-1313-3668 pod/csi-mockplugin-0 node/ci-op-jyv2v8ft-694a5-zcv8h-worker-0-xccxs container/driver-registrar container exited with code 2 (Error): 
Sep 19 21:12:21.878 E ns/e2e-provisioning-1005-5651 pod/csi-hostpathplugin-0 node/ci-op-jyv2v8ft-694a5-zcv8h-worker-0-6w2n6 container/liveness-probe container exited with code 2 (Error): 
Sep 19 21:12:21.878 E ns/e2e-provisioning-1005-5651 pod/csi-hostpathplugin-0 node/ci-op-jyv2v8ft-694a5-zcv8h-worker-0-6w2n6 container/node-driver-registrar container exited with code 2 (Error): 
Sep 19 21:12:21.926 E ns/e2e-provisioning-1005-5651 pod/csi-hostpath-provisioner-0 node/ci-op-jyv2v8ft-694a5-zcv8h-worker-0-6w2n6 container/csi-provisioner container exited with code 2 (Error): 
Sep 19 21:12:49.232 E ns/openshift-marketplace pod/community-operators-2sgjw node/ci-op-jyv2v8ft-694a5-zcv8h-worker-0-6w2n6 container/registry-server container exited with code 1 (Error): 
Sep 19 21:13:07.394 E ns/e2e-port-forwarding-1416 pod/pfpod node/ci-op-jyv2v8ft-694a5-zcv8h-worker-0-6w2n6 container/portforwardtester container exited with code 2 (Error): 
Sep 19 21:13:15.747 E ns/e2e-network-policy-3813 pod/client-a-6zk8l node/ci-op-jyv2v8ft-694a5-zcv8h-worker-0-6w2n6 container/client init container exited with code 1 (Error): 
Sep 19 21:13:15.747 E ns/e2e-network-policy-3813 pod/client-a-6zk8l node/ci-op-jyv2v8ft-694a5-zcv8h-worker-0-6w2n6 reason/Failed (): 
Sep 19 21:13:15.747 E ns/e2e-network-policy-3813 pod/client-a-6zk8l node/ci-op-jyv2v8ft-694a5-zcv8h-worker-0-6w2n6 container/client container exited with code 1 (Error): 
Sep 19 21:13:30.056 E ns/e2e-pods-355 pod/pod-submit-status-0-3 node/ci-op-jyv2v8ft-694a5-zcv8h-worker-0-6w2n6 container/busybox init container exited with code 1 (Error): 
Sep 19 21:13:30.056 E ns/e2e-pods-355 pod/pod-submit-status-0-3 node/ci-op-jyv2v8ft-694a5-zcv8h-worker-0-6w2n6 reason/Failed (): 
Sep 19 21:13:30.056 E ns/e2e-pods-355 pod/pod-submit-status-0-3 node/ci-op-jyv2v8ft-694a5-zcv8h-worker-0-6w2n6 container/busybox container exited with code 1 (Error): 
Sep 19 21:13:32.381 E ns/e2e-volume-5673-3098 pod/csi-hostpath-snapshotter-0 node/ci-op-jyv2v8ft-694a5-zcv8h-worker-0-xccxs container/csi-snapshotter container exited with code 2 (Error): 
Sep 19 21:13:32.502 E ns/e2e-volume-5673-3098 pod/csi-hostpath-resizer-0 node/ci-op-jyv2v8ft-694a5-zcv8h-worker-0-xccxs container/csi-resizer container exited with code 2 (Error): 
Sep 19 21:13:48.341 E ns/e2e-net-services1-31 pod/service-7mkq5 node/ci-op-jyv2v8ft-694a5-zcv8h-worker-0-6w2n6 container/service-7mkq5-container init container exited with code 2 (Error): 
Sep 19 21:13:48.341 E ns/e2e-net-services1-31 pod/service-7mkq5 node/ci-op-jyv2v8ft-694a5-zcv8h-worker-0-6w2n6 reason/Failed (): 
Sep 19 21:13:48.341 E ns/e2e-net-services1-31 pod/service-7mkq5 node/ci-op-jyv2v8ft-694a5-zcv8h-worker-0-6w2n6 container/service-7mkq5-container container exited with code 2 (Error): 
Sep 19 21:13:59.370 E ns/e2e-provisioning-1791 pod/pod-subpath-test-preprovisionedpv-8zfr node/ci-op-jyv2v8ft-694a5-zcv8h-worker-0-xccxs container/test-container-volume-preprovisionedpv-8zfr init container exited with code 137 (Error): 
Sep 19 21:13:59.370 E ns/e2e-provisioning-1791 pod/pod-subpath-test-preprovisionedpv-8zfr node/ci-op-jyv2v8ft-694a5-zcv8h-worker-0-xccxs reason/Failed (): 
Sep 19 21:13:59.370 E ns/e2e-provisioning-1791 pod/pod-subpath-test-preprovisionedpv-8zfr node/ci-op-jyv2v8ft-694a5-zcv8h-worker-0-xccxs container/test-container-volume-preprovisionedpv-8zfr container exited with code 137 (Error): 
Sep 19 21:14:28.561 E ns/openshift-marketplace pod/community-operators-d5f8l node/ci-op-jyv2v8ft-694a5-zcv8h-worker-0-xccxs container/registry-server container exited with code 1 (Error): 
Sep 19 21:15:02.924 E ns/e2e-volume-expand-819-4063 pod/csi-hostpathplugin-0 node/ci-op-jyv2v8ft-694a5-zcv8h-worker-0-xccxs container/liveness-probe container exited with code 2 (Error): 
Sep 19 21:15:02.924 E ns/e2e-volume-expand-819-4063 pod/csi-hostpathplugin-0 node/ci-op-jyv2v8ft-694a5-zcv8h-worker-0-xccxs container/node-driver-registrar container exited with code 2 (Error): 
Sep 19 21:15:02.941 E ns/e2e-volume-expand-819-4063 pod/csi-hostpath-provisioner-0 node/ci-op-jyv2v8ft-694a5-zcv8h-worker-0-xccxs container/csi-provisioner container exited with code 2 (Error): 
Sep 19 21:15:02.980 E ns/e2e-volume-expand-819-4063 pod/csi-hostpath-resizer-0 node/ci-op-jyv2v8ft-694a5-zcv8h-worker-0-xccxs container/csi-resizer container exited with code 2 (Error): 
Sep 19 21:15:23.287 E ns/e2e-network-policy-c-2043 pod/client-a-ftmp8 node/ci-op-jyv2v8ft-694a5-zcv8h-worker-0-6w2n6 container/client init container exited with code 1 (Error): 
Sep 19 21:15:23.287 E ns/e2e-network-policy-c-2043 pod/client-a-ftmp8 node/ci-op-jyv2v8ft-694a5-zcv8h-worker-0-6w2n6 reason/Failed (): 
Sep 19 21:15:23.287 E ns/e2e-network-policy-c-2043 pod/client-a-ftmp8 node/ci-op-jyv2v8ft-694a5-zcv8h-worker-0-6w2n6 container/client container exited with code 1 (Error): 
Sep 19 21:16:08.613 E ns/e2e-snapshotting-9088-9131 pod/csi-hostpath-attacher-0 node/ci-op-jyv2v8ft-694a5-zcv8h-worker-0-6w2n6 container/csi-attacher container exited with code 2 (Error): 
Sep 19 21:16:19.564 E ns/e2e-csi-mock-volumes-1997-525 pod/csi-mockplugin-attacher-0 node/ci-op-jyv2v8ft-694a5-zcv8h-worker-0-xccxs container/csi-attacher container exited with code 255 (Error): Lost connection to CSI driver, exiting
Sep 19 21:16:24.831 E ns/e2e-services-771 pod/pod1 node/ci-op-jyv2v8ft-694a5-zcv8h-worker-0-6w2n6 container/pause container exited with code 2 (Error): 
Sep 19 21:16:26.602 E ns/e2e-services-771 pod/pod2 node/ci-op-jyv2v8ft-694a5-zcv8h-worker-0-xccxs container/pause container exited with code 2 (Error): 
Sep 19 21:16:47.112 E ns/e2e-test-router-metrics-r8lfp pod/execpod node/ci-op-jyv2v8ft-694a5-zcv8h-worker-0-6w2n6 container/agnhost container exited with code 2 (Error): 
Sep 19 21:16:56.717 E ns/e2e-volume-6669 pod/local-injector node/ci-op-jyv2v8ft-694a5-zcv8h-worker-0-xccxs container/local-injector container exited with code 137 (Error): 
Sep 19 21:17:08.771 E ns/e2e-volume-6669 pod/local-client node/ci-op-jyv2v8ft-694a5-zcv8h-worker-0-xccxs container/local-client container exited with code 137 (Error): 
Sep 19 21:17:31.118 E ns/e2e-snapshotting-5327-6022 pod/csi-hostpathplugin-0 node/ci-op-jyv2v8ft-694a5-zcv8h-worker-0-xccxs container/liveness-probe container exited with code 2 (Error): 
Sep 19 21:17:31.118 E ns/e2e-snapshotting-5327-6022 pod/csi-hostpathplugin-0 node/ci-op-jyv2v8ft-694a5-zcv8h-worker-0-xccxs container/node-driver-registrar container exited with code 2 (Error): 
Sep 19 21:17:39.038 E ns/e2e-services-8995 pod/externalsvc-krpp8 node/ci-op-jyv2v8ft-694a5-zcv8h-worker-0-xccxs container/externalsvc container exited with code 137 (Error): 
Sep 19 21:17:48.217 E ns/e2e-job-4369 pod/backofflimit-z6h9s node/ci-op-jyv2v8ft-694a5-zcv8h-worker-0-xccxs container/c init container exited with code 1 (Error): 
Sep 19 21:17:48.217 E ns/e2e-job-4369 pod/backofflimit-z6h9s node/ci-op-jyv2v8ft-694a5-zcv8h-worker-0-xccxs reason/Failed (): 
Sep 19 21:17:48.217 E ns/e2e-job-4369 pod/backofflimit-z6h9s node/ci-op-jyv2v8ft-694a5-zcv8h-worker-0-xccxs container/c container exited with code 1 (Error): 
Sep 19 21:17:52.146 E ns/e2e-job-4369 pod/backofflimit-nzg5d node/ci-op-jyv2v8ft-694a5-zcv8h-worker-0-xccxs container/c init container exited with code 1 (Error): 
Sep 19 21:17:52.146 E ns/e2e-job-4369 pod/backofflimit-nzg5d node/ci-op-jyv2v8ft-694a5-zcv8h-worker-0-xccxs reason/Failed (): 
Sep 19 21:17:52.146 E ns/e2e-job-4369 pod/backofflimit-nzg5d node/ci-op-jyv2v8ft-694a5-zcv8h-worker-0-xccxs container/c container exited with code 1 (Error): 
Sep 19 21:18:01.992 E ns/openshift-marketplace pod/community-operators-2sgjw node/ci-op-jyv2v8ft-694a5-zcv8h-worker-0-6w2n6 container/registry-server container exited with code 1 (Error): 
Sep 19 21:18:17.093 E ns/e2e-kubelet-etc-hosts-8320 pod/test-host-network-pod node/ci-op-jyv2v8ft-694a5-zcv8h-worker-0-6w2n6 container/busybox-2 container exited with code 137 (Error): 
Sep 19 21:18:17.093 E ns/e2e-kubelet-etc-hosts-8320 pod/test-host-network-pod node/ci-op-jyv2v8ft-694a5-zcv8h-worker-0-6w2n6 container/busybox-1 container exited with code 137 (Error): 
Sep 19 21:18:57.425 E ns/e2e-provisioning-9368 pod/pod-subpath-test-preprovisionedpv-2cmh node/ci-op-jyv2v8ft-694a5-zcv8h-worker-0-xccxs container/test-container-volume-preprovisionedpv-2cmh init container exited with code 137 (Error): 
Sep 19 21:18:57.425 E ns/e2e-provisioning-9368 pod/pod-subpath-test-preprovisionedpv-2cmh node/ci-op-jyv2v8ft-694a5-zcv8h-worker-0-xccxs reason/Failed (): 
Sep 19 21:18:57.425 E ns/e2e-provisioning-9368 pod/pod-subpath-test-preprovisionedpv-2cmh node/ci-op-jyv2v8ft-694a5-zcv8h-worker-0-xccxs container/test-container-volume-preprovisionedpv-2cmh container exited with code 137 (Error): 
Sep 19 21:19:30.624 E ns/openshift-marketplace pod/community-operators-d5f8l node/ci-op-jyv2v8ft-694a5-zcv8h-worker-0-xccxs container/registry-server container exited with code 1 (Error): 
Sep 19 21:19:49.268 E ns/e2e-volumemode-9673 pod/external-provisioner-gd8w9 node/ci-op-jyv2v8ft-694a5-zcv8h-worker-0-6w2n6 container/nfs-provisioner container exited with code 2 (Error): 
Sep 19 21:19:53.273 E ns/e2e-network-policy-b-331 pod/client-a-6sx2d node/ci-op-jyv2v8ft-694a5-zcv8h-worker-0-6w2n6 container/client init container exited with code 1 (Error): 
Sep 19 21:19:53.273 E ns/e2e-network-policy-b-331 pod/client-a-6sx2d node/ci-op-jyv2v8ft-694a5-zcv8h-worker-0-6w2n6 reason/Failed (): 
Sep 19 21:19:53.273 E ns/e2e-network-policy-b-331 pod/client-a-6sx2d node/ci-op-jyv2v8ft-694a5-zcv8h-worker-0-6w2n6 container/client container exited with code 1 (Error): 
Sep 19 21:19:56.730 E ns/e2e-provisioning-5926 pod/pod-subpath-test-preprovisionedpv-n6pt node/ci-op-jyv2v8ft-694a5-zcv8h-worker-0-xccxs container/test-container-volume-preprovisionedpv-n6pt init container exited with code 137 (Error): 
Sep 19 21:19:56.730 E ns/e2e-provisioning-5926 pod/pod-subpath-test-preprovisionedpv-n6pt node/ci-op-jyv2v8ft-694a5-zcv8h-worker-0-xccxs reason/Failed (): 
Sep 19 21:19:56.730 E ns/e2e-provisioning-5926 pod/pod-subpath-test-preprovisionedpv-n6pt node/ci-op-jyv2v8ft-694a5-zcv8h-worker-0-xccxs container/test-container-volume-preprovisionedpv-n6pt container exited with code 137 (Error): 
Sep 19 21:20:42.754 E ns/e2e-network-policy-6529 pod/client-b-ffr6m node/ci-op-jyv2v8ft-694a5-zcv8h-worker-0-6w2n6 container/client init container exited with code 1 (Error): 
Sep 19 21:20:42.754 E ns/e2e-network-policy-6529 pod/client-b-ffr6m node/ci-op-jyv2v8ft-694a5-zcv8h-worker-0-6w2n6 reason/Failed (): 
Sep 19 21:20:42.754 E ns/e2e-network-policy-6529 pod/client-b-ffr6m node/ci-op-jyv2v8ft-694a5-zcv8h-worker-0-6w2n6 container/client container exited with code 1 (Error): 
Sep 19 21:20:54.957 E ns/e2e-provisioning-8235-7975 pod/csi-hostpathplugin-0 node/ci-op-jyv2v8ft-694a5-zcv8h-worker-0-xccxs container/liveness-probe container exited with code 2 (Error): 
Sep 19 21:20:54.957 E ns/e2e-provisioning-8235-7975 pod/csi-hostpathplugin-0 node/ci-op-jyv2v8ft-694a5-zcv8h-worker-0-xccxs container/node-driver-registrar container exited with code 2 (Error): 
Sep 19 21:20:57.896 E ns/e2e-test-cli-deployment-4wx2h pod/deployment-simple-1-8dmhl node/ci-op-jyv2v8ft-694a5-zcv8h-worker-0-6w2n6 container/myapp container exited with code 137 (Error): 
Sep 19 21:21:06.950 E ns/e2e-projected-4478 pod/labelsupdateb714cdb9-3463-4a17-a00c-0027f62e3ce5 node/ci-op-jyv2v8ft-694a5-zcv8h-worker-0-xccxs container/client-container init container exited with code 2 (Error): 
Sep 19 21:21:06.950 E ns/e2e-projected-4478 pod/labelsupdateb714cdb9-3463-4a17-a00c-0027f62e3ce5 node/ci-op-jyv2v8ft-694a5-zcv8h-worker-0-xccxs reason/Failed (): 
Sep 19 21:21:06.950 E ns/e2e-projected-4478 pod/labelsupdateb714cdb9-3463-4a17-a00c-0027f62e3ce5 node/ci-op-jyv2v8ft-694a5-zcv8h-worker-0-xccxs container/client-container container exited with code 2 (Error): 
Sep 19 21:21:10.933 E ns/e2e-test-cli-deployment-4wx2h pod/deployment-simple-2-779pv node/ci-op-jyv2v8ft-694a5-zcv8h-worker-0-6w2n6 container/myapp container exited with code 137 (Error): 
Sep 19 21:21:22.122 E ns/e2e-csi-mock-volumes-7328-7148 pod/csi-mockplugin-attacher-0 node/ci-op-jyv2v8ft-694a5-zcv8h-worker-0-6w2n6 container/csi-attacher container exited with code 255 (Error): Lost connection to CSI driver, exiting
Sep 19 21:21:24.039 E ns/e2e-services-4217 pod/affinity-nodeport-transition-8gxxw node/ci-op-jyv2v8ft-694a5-zcv8h-worker-0-xccxs container/affinity-nodeport-transition container exited with code 137 (Error): 
Sep 19 21:21:24.186 E ns/e2e-services-4217 pod/affinity-nodeport-transition-j7htv node/ci-op-jyv2v8ft-694a5-zcv8h-worker-0-6w2n6 container/affinity-nodeport-transition container exited with code 137 (Error): 
Sep 19 21:21:47.257 E ns/e2e-network-policy-5363 pod/client-a-v8gg8 node/ci-op-jyv2v8ft-694a5-zcv8h-worker-0-6w2n6 container/client container exited with code 1 (Error): 
Sep 19 21:22:30.533 E ns/e2e-csi-mock-volumes-1340-677 pod/csi-mockplugin-0 node/ci-op-jyv2v8ft-694a5-zcv8h-worker-0-xccxs container/driver-registrar container exited with code 2 (Error): 
Sep 19 21:22:30.533 E ns/e2e-csi-mock-volumes-1340-677 pod/csi-mockplugin-0 node/ci-op-jyv2v8ft-694a5-zcv8h-worker-0-xccxs container/csi-provisioner container exited with code 2 (Error): Lost connection to CSI driver, exiting
Sep 19 21:22:33.493 E ns/e2e-network-policy-5363 pod/client-a-v8gg8 node/ci-op-jyv2v8ft-694a5-zcv8h-worker-0-6w2n6 container/client container exited with code 1 (Error): 
Sep 19 21:22:39.569 E ns/e2e-csi-mock-volumes-863-3277 pod/csi-mockplugin-0 node/ci-op-jyv2v8ft-694a5-zcv8h-worker-0-xccxs container/csi-provisioner container exited with code 2 (Error): 
Sep 19 21:22:39.569 E ns/e2e-csi-mock-volumes-863-3277 pod/csi-mockplugin-0 node/ci-op-jyv2v8ft-694a5-zcv8h-worker-0-xccxs container/driver-registrar container exited with code 2 (Error): 
Sep 19 21:22:43.642 E ns/e2e-provisioning-3306-3515 pod/csi-hostpath-attacher-0 node/ci-op-jyv2v8ft-694a5-zcv8h-worker-0-6w2n6 container/csi-attacher container exited with code 2 (Error): 
Sep 19 21:22:57.812 E ns/e2e-network-policy-5363 pod/server-6zttl node/ci-op-jyv2v8ft-694a5-zcv8h-worker-0-6w2n6 container/server-container-81 init container exited with code 2 (Error): 
Sep 19 21:22:57.812 E ns/e2e-network-policy-5363 pod/server-6zttl node/ci-op-jyv2v8ft-694a5-zcv8h-worker-0-6w2n6 container/server-container-80 init container exited with code 2 (Error): 
Sep 19 21:22:57.812 E ns/e2e-network-policy-5363 pod/server-6zttl node/ci-op-jyv2v8ft-694a5-zcv8h-worker-0-6w2n6 reason/Failed (): 
Sep 19 21:22:57.812 E ns/e2e-network-policy-5363 pod/server-6zttl node/ci-op-jyv2v8ft-694a5-zcv8h-worker-0-6w2n6 container/server-container-81 container exited with code 2 (Error): 
Sep 19 21:22:57.812 E ns/e2e-network-policy-5363 pod/server-6zttl node/ci-op-jyv2v8ft-694a5-zcv8h-worker-0-6w2n6 container/server-container-80 container exited with code 2 (Error): 
Sep 19 21:23:09.857 E ns/openshift-marketplace pod/community-operators-2sgjw node/ci-op-jyv2v8ft-694a5-zcv8h-worker-0-6w2n6 container/registry-server container exited with code 1 (Error): 
Sep 19 21:23:19.976 E ns/e2e-test-deployment-trigger-twgck pod/config-2-deploy node/ci-op-jyv2v8ft-694a5-zcv8h-worker-0-6w2n6 container/deployment init container exited with code 2 (Error): 
Sep 19 21:23:19.976 E ns/e2e-test-deployment-trigger-twgck pod/config-2-deploy node/ci-op-jyv2v8ft-694a5-zcv8h-worker-0-6w2n6 reason/Failed (): 
Sep 19 21:23:19.976 E ns/e2e-test-deployment-trigger-twgck pod/config-2-deploy node/ci-op-jyv2v8ft-694a5-zcv8h-worker-0-6w2n6 container/deployment container exited with code 2 (Error): 
Sep 19 21:23:24.717 E ns/e2e-provisioning-9829-6051 pod/csi-hostpath-attacher-0 node/ci-op-jyv2v8ft-694a5-zcv8h-worker-0-xccxs container/csi-attacher container exited with code 2 (Error): 
Sep 19 21:23:25.694 E ns/e2e-provisioning-9829-6051 pod/csi-hostpath-resizer-0 node/ci-op-jyv2v8ft-694a5-zcv8h-worker-0-xccxs container/csi-resizer container exited with code 2 (Error): 
Sep 19 21:23:25.744 E ns/e2e-provisioning-9829-6051 pod/csi-hostpath-provisioner-0 node/ci-op-jyv2v8ft-694a5-zcv8h-worker-0-xccxs container/csi-provisioner container exited with code 2 (Error): 
Sep 19 21:23:26.009 E ns/e2e-net-services1-7298 pod/service-zcrrg node/ci-op-jyv2v8ft-694a5-zcv8h-worker-0-6w2n6 container/service-zcrrg-container init container exited with code 2 (Error): 
Sep 19 21:23:26.009 E ns/e2e-net-services1-7298 pod/service-zcrrg node/ci-op-jyv2v8ft-694a5-zcv8h-worker-0-6w2n6 reason/Failed (): 
Sep 19 21:23:26.009 E ns/e2e-net-services1-7298 pod/service-zcrrg node/ci-op-jyv2v8ft-694a5-zcv8h-worker-0-6w2n6 container/service-zcrrg-container container exited with code 2 (Error): 
Sep 19 21:23:49.125 E ns/e2e-projected-8174 pod/pod-projected-secrets-d7b383d9-a563-4542-acf2-44f7a3d5c9e5 node/ci-op-jyv2v8ft-694a5-zcv8h-worker-0-6w2n6 container/upds-volume-test init container exited with code 2 (Error): 
Sep 19 21:23:49.125 E ns/e2e-projected-8174 pod/pod-projected-secrets-d7b383d9-a563-4542-acf2-44f7a3d5c9e5 node/ci-op-jyv2v8ft-694a5-zcv8h-worker-0-6w2n6 container/dels-volume-test init container exited with code 2 (Error): 
Sep 19 21:23:49.125 E ns/e2e-projected-8174 pod/pod-projected-secrets-d7b383d9-a563-4542-acf2-44f7a3d5c9e5 node/ci-op-jyv2v8ft-694a5-zcv8h-worker-0-6w2n6 container/creates-volume-test init container exited with code 2 (Error): 
Sep 19 21:23:49.125 E ns/e2e-projected-8174 pod/pod-projected-secrets-d7b383d9-a563-4542-acf2-44f7a3d5c9e5 node/ci-op-jyv2v8ft-694a5-zcv8h-worker-0-6w2n6 reason/Failed (): 
Sep 19 21:23:49.125 E ns/e2e-projected-8174 pod/pod-projected-secrets-d7b383d9-a563-4542-acf2-44f7a3d5c9e5 node/ci-op-jyv2v8ft-694a5-zcv8h-worker-0-6w2n6 container/upds-volume-test container exited with code 2 (Error): 
Sep 19 21:23:49.125 E ns/e2e-projected-8174 pod/pod-projected-secrets-d7b383d9-a563-4542-acf2-44f7a3d5c9e5 node/ci-op-jyv2v8ft-694a5-zcv8h-worker-0-6w2n6 container/dels-volume-test container exited with code 2 (Error): 
Sep 19 21:23:49.125 E ns/e2e-projected-8174 pod/pod-projected-secrets-d7b383d9-a563-4542-acf2-44f7a3d5c9e5 node/ci-op-jyv2v8ft-694a5-zcv8h-worker-0-6w2n6 container/creates-volume-test container exited with code 2 (Error): 
Sep 19 21:23:49.934 E ns/e2e-services-1854 pod/externalsvc-9frzs node/ci-op-jyv2v8ft-694a5-zcv8h-worker-0-xccxs container/externalsvc container exited with code 137 (Error): 
Sep 19 21:23:50.160 E ns/e2e-services-1854 pod/externalsvc-6tkht node/ci-op-jyv2v8ft-694a5-zcv8h-worker-0-6w2n6 container/externalsvc container exited with code 137 (Error): 
Sep 19 21:24:07.332 E ns/e2e-container-probe-6374 pod/test-webserver-cd73dbab-e968-429f-95be-a4df7c1fef20 node/ci-op-jyv2v8ft-694a5-zcv8h-worker-0-6w2n6 container/test-webserver container exited with code 2 (Error): 
Sep 19 21:24:13.136 E ns/e2e-provisioning-3834-7775 pod/csi-hostpath-provisioner-0 node/ci-op-jyv2v8ft-694a5-zcv8h-worker-0-xccxs container/csi-provisioner container exited with code 2 (Error): 
Sep 19 21:24:41.229 E ns/openshift-marketplace pod/community-operators-d5f8l node/ci-op-jyv2v8ft-694a5-zcv8h-worker-0-xccxs container/registry-server container exited with code 1 (Error): 
Sep 19 21:24:48.658 E ns/e2e-network-policy-1961 pod/client-a-ph5lj node/ci-op-jyv2v8ft-694a5-zcv8h-worker-0-6w2n6 container/client init container exited with code 1 (Error): 
Sep 19 21:24:48.658 E ns/e2e-network-policy-1961 pod/client-a-ph5lj node/ci-op-jyv2v8ft-694a5-zcv8h-worker-0-6w2n6 reason/Failed (): 
Sep 19 21:24:48.659 E ns/e2e-network-policy-1961 pod/client-a-ph5lj node/ci-op-jyv2v8ft-694a5-zcv8h-worker-0-6w2n6 container/client container exited with code 1 (Error): 
Sep 19 21:24:52.690 E ns/e2e-test-cli-deployment-vvjjm pod/deployment-simple-1-pjpt5 node/ci-op-jyv2v8ft-694a5-zcv8h-worker-0-6w2n6 container/myapp container exited with code 137 (Error): 
Sep 19 21:24:55.805 E ns/e2e-csi-mock-volumes-8188-2017 pod/csi-mockplugin-attacher-0 node/ci-op-jyv2v8ft-694a5-zcv8h-worker-0-6w2n6 container/csi-attacher container exited with code 255 (Error): Lost connection to CSI driver, exiting
Sep 19 21:26:03.858 E ns/e2e-test-image-change-build-trigger-ckvmj pod/sti-imagestreamtag-1-build node/ci-op-jyv2v8ft-694a5-zcv8h-worker-0-6w2n6 container/git-clone container exited with code 1 (Error): Cloning "git://github.com/openshift/ruby-hello-world.git" ...\n	Commit:	57073c041d103a412ff7d4a6e64b0ea7f77ea1b3 (Merge pull request #85 from wewang58/master)\n	Author:	Ben Parees <bparees@users.noreply.github.com>\n	Date:	Wed Nov 6 09:41:20 2019 -0500\nerror: provided context directory does not exist: contextimage\n
Sep 19 21:26:03.858 E ns/e2e-test-image-change-build-trigger-ckvmj pod/sti-imagestreamtag-1-build node/ci-op-jyv2v8ft-694a5-zcv8h-worker-0-6w2n6 reason/Failed (): 
Sep 19 21:26:03.858 E ns/e2e-test-image-change-build-trigger-ckvmj pod/sti-imagestreamtag-1-build node/ci-op-jyv2v8ft-694a5-zcv8h-worker-0-6w2n6 container/git-clone init container exited with code 1 (Error): Cloning "git://github.com/openshift/ruby-hello-world.git" ...\n	Commit:	57073c041d103a412ff7d4a6e64b0ea7f77ea1b3 (Merge pull request #85 from wewang58/master)\n	Author:	Ben Parees <bparees@users.noreply.github.com>\n	Date:	Wed Nov 6 09:41:20 2019 -0500\nerror: provided context directory does not exist: contextimage\n
Sep 19 21:26:05.871 E ns/e2e-test-image-change-build-trigger-ckvmj pod/sti-imagestreamtag-2-build node/ci-op-jyv2v8ft-694a5-zcv8h-worker-0-6w2n6 container/git-clone container exited with code 1 (Error): Cloning "git://github.com/openshift/ruby-hello-world.git" ...\n	Commit:	57073c041d103a412ff7d4a6e64b0ea7f77ea1b3 (Merge pull request #85 from wewang58/master)\n	Author:	Ben Parees <bparees@users.noreply.github.com>\n	Date:	Wed Nov 6 09:41:20 2019 -0500\nerror: provided context directory does not exist: contextimage\n
Sep 19 21:26:05.871 E ns/e2e-test-image-change-build-trigger-ckvmj pod/sti-imagestreamtag-2-build node/ci-op-jyv2v8ft-694a5-zcv8h-worker-0-6w2n6 reason/Failed (): 
Sep 19 21:26:05.871 E ns/e2e-test-image-change-build-trigger-ckvmj pod/sti-imagestreamtag-2-build node/ci-op-jyv2v8ft-694a5-zcv8h-worker-0-6w2n6 container/git-clone init container exited with code 1 (Error): Cloning "git://github.com/openshift/ruby-hello-world.git" ...\n	Commit:	57073c041d103a412ff7d4a6e64b0ea7f77ea1b3 (Merge pull request #85 from wewang58/master)\n	Author:	Ben Parees <bparees@users.noreply.github.com>\n	Date:	Wed Nov 6 09:41:20 2019 -0500\nerror: provided context directory does not exist: contextimage\n
Sep 19 21:26:27.962 E ns/e2e-network-policy-3641 pod/client-a-l9gtr node/ci-op-jyv2v8ft-694a5-zcv8h-worker-0-6w2n6 container/client init container exited with code 1 (Error): 
Sep 19 21:26:27.962 E ns/e2e-network-policy-3641 pod/client-a-l9gtr node/ci-op-jyv2v8ft-694a5-zcv8h-worker-0-6w2n6 reason/Failed (): 
Sep 19 21:26:27.962 E ns/e2e-network-policy-3641 pod/client-a-l9gtr node/ci-op-jyv2v8ft-694a5-zcv8h-worker-0-6w2n6 container/client container exited with code 1 (Error): 
Sep 19 21:27:29.220 E ns/e2e-network-policy-7978 pod/client-a-dxnx9 node/ci-op-jyv2v8ft-694a5-zcv8h-worker-0-6w2n6 container/client init container exited with code 1 (Error): 
Sep 19 21:27:29.220 E ns/e2e-network-policy-7978 pod/client-a-dxnx9 node/ci-op-jyv2v8ft-694a5-zcv8h-worker-0-6w2n6 reason/Failed (): 
Sep 19 21:27:29.220 E ns/e2e-network-policy-7978 pod/client-a-dxnx9 node/ci-op-jyv2v8ft-694a5-zcv8h-worker-0-6w2n6 container/client container exited with code 1 (Error): 
Sep 19 21:27:53.110 E ns/e2e-volume-expand-2111-7754 pod/csi-hostpathplugin-0 node/ci-op-jyv2v8ft-694a5-zcv8h-worker-0-xccxs container/node-driver-registrar container exited with code 2 (Error): 
Sep 19 21:27:53.110 E ns/e2e-volume-expand-2111-7754 pod/csi-hostpathplugin-0 node/ci-op-jyv2v8ft-694a5-zcv8h-worker-0-xccxs container/liveness-probe container exited with code 2 (Error): 
Sep 19 21:27:53.110 E ns/e2e-volume-expand-2111-7754 pod/csi-hostpath-attacher-0 node/ci-op-jyv2v8ft-694a5-zcv8h-worker-0-xccxs container/csi-attacher container exited with code 2 (Error): 
Sep 19 21:27:53.114 E ns/e2e-volume-expand-2111-7754 pod/csi-hostpath-provisioner-0 node/ci-op-jyv2v8ft-694a5-zcv8h-worker-0-xccxs container/csi-provisioner container exited with code 2 (Error): 
Sep 19 21:27:53.140 E ns/e2e-volume-expand-2111-7754 pod/csi-hostpath-resizer-0 node/ci-op-jyv2v8ft-694a5-zcv8h-worker-0-xccxs container/csi-resizer container exited with code 2 (Error): 
Sep 19 21:28:17.854 E ns/openshift-marketplace pod/community-operators-2sgjw node/ci-op-jyv2v8ft-694a5-zcv8h-worker-0-6w2n6 container/registry-server container exited with code 1 (Error): 
Sep 19 21:28:34.198 E ns/e2e-test-cli-deployment-hjl92 pod/hook-1-hook-pre node/ci-op-jyv2v8ft-694a5-zcv8h-worker-0-6w2n6 container/lifecycle container exited with code 1 (Error): 
Sep 19 21:28:43.336 E ns/e2e-port-forwarding-9318 pod/pfpod node/ci-op-jyv2v8ft-694a5-zcv8h-worker-0-6w2n6 container/portforwardtester container exited with code 4 (Error): 
Sep 19 21:28:45.326 E ns/e2e-test-cli-deployment-hjl92 pod/hook-1-deploy node/ci-op-jyv2v8ft-694a5-zcv8h-worker-0-6w2n6 container/deployment init container exited with code 2 (Error): 
Sep 19 21:28:45.326 E ns/e2e-test-cli-deployment-hjl92 pod/hook-1-deploy node/ci-op-jyv2v8ft-694a5-zcv8h-worker-0-6w2n6 reason/Failed (): 
Sep 19 21:28:45.326 E ns/e2e-test-cli-deployment-hjl92 pod/hook-1-deploy node/ci-op-jyv2v8ft-694a5-zcv8h-worker-0-6w2n6 container/deployment container exited with code 2 (Error): 
Sep 19 21:28:50.546 E ns/e2e-container-runtime-6201 pod/termination-message-container7446c3ba-f281-4a5e-9aae-c722b20ed322 node/ci-op-jyv2v8ft-694a5-zcv8h-worker-0-6w2n6 container/termination-message-container init container exited with code 1 (Error): DONE
Sep 19 21:28:50.546 E ns/e2e-container-runtime-6201 pod/termination-message-container7446c3ba-f281-4a5e-9aae-c722b20ed322 node/ci-op-jyv2v8ft-694a5-zcv8h-worker-0-6w2n6 reason/Failed (): 
Sep 19 21:28:50.546 E ns/e2e-container-runtime-6201 pod/termination-message-container7446c3ba-f281-4a5e-9aae-c722b20ed322 node/ci-op-jyv2v8ft-694a5-zcv8h-worker-0-6w2n6 container/termination-message-container container exited with code 1 (Error): DONE
Sep 19 21:29:32.317 E ns/e2e-test-cli-deployment-ghww6 pod/deployment-simple-1-deploy node/ci-op-jyv2v8ft-694a5-zcv8h-worker-0-6w2n6 container/deployment init container exited with code 2 (Error): 
Sep 19 21:29:32.317 E ns/e2e-test-cli-deployment-ghww6 pod/deployment-simple-1-deploy node/ci-op-jyv2v8ft-694a5-zcv8h-worker-0-6w2n6 reason/Failed (): 
Sep 19 21:29:32.317 E ns/e2e-test-cli-deployment-ghww6 pod/deployment-simple-1-deploy node/ci-op-jyv2v8ft-694a5-zcv8h-worker-0-6w2n6 container/deployment container exited with code 2 (Error): 
Sep 19 21:29:45.506 E ns/e2e-test-cli-deployment-ghww6 pod/deployment-simple-2-deploy node/ci-op-jyv2v8ft-694a5-zcv8h-worker-0-6w2n6 container/deployment init container exited with code 1 (Error): 
Sep 19 21:29:45.506 E ns/e2e-test-cli-deployment-ghww6 pod/deployment-simple-2-deploy node/ci-op-jyv2v8ft-694a5-zcv8h-worker-0-6w2n6 reason/Failed (): 
Sep 19 21:29:45.506 E ns/e2e-test-cli-deployment-ghww6 pod/deployment-simple-2-deploy node/ci-op-jyv2v8ft-694a5-zcv8h-worker-0-6w2n6 container/deployment container exited with code 1 (Error): 
Sep 19 21:29:46.508 E ns/e2e-test-cli-deployment-bj2qc pod/deployment-simple-2-8bt9l node/ci-op-jyv2v8ft-694a5-zcv8h-worker-0-6w2n6 container/myapp container exited with code 137 (Error): 
Sep 19 21:29:48.829 E ns/openshift-marketplace pod/community-operators-d5f8l node/ci-op-jyv2v8ft-694a5-zcv8h-worker-0-xccxs container/registry-server container exited with code 1 (Error): 
Sep 19 21:30:06.992 E ns/e2e-test-cli-deployment-ghww6 pod/deployment-simple-1-sk94b node/ci-op-jyv2v8ft-694a5-zcv8h-worker-0-6w2n6 container/myapp container exited with code 137 (Error): 
Sep 19 21:30:30.211 E ns/e2e-network-policy-777 pod/client-b-lzzw7 node/ci-op-jyv2v8ft-694a5-zcv8h-worker-0-6w2n6 container/client init container exited with code 1 (Error): 
Sep 19 21:30:30.211 E ns/e2e-network-policy-777 pod/client-b-lzzw7 node/ci-op-jyv2v8ft-694a5-zcv8h-worker-0-6w2n6 reason/Failed (): 
Sep 19 21:30:30.211 E ns/e2e-network-policy-777 pod/client-b-lzzw7 node/ci-op-jyv2v8ft-694a5-zcv8h-worker-0-6w2n6 container/client container exited with code 1 (Error): 
Sep 19 21:30:37.181 E ns/e2e-network-policy-1654 pod/client-b-4gnjw node/ci-op-jyv2v8ft-694a5-zcv8h-worker-0-xccxs container/client init container exited with code 1 (Error): 
Sep 19 21:30:37.181 E ns/e2e-network-policy-1654 pod/client-b-4gnjw node/ci-op-jyv2v8ft-694a5-zcv8h-worker-0-xccxs reason/Failed (): 
Sep 19 21:30:37.181 E ns/e2e-network-policy-1654 pod/client-b-4gnjw node/ci-op-jyv2v8ft-694a5-zcv8h-worker-0-xccxs container/client container exited with code 1 (Error): 
Sep 19 21:30:46.706 E ns/e2e-kubelet-test-8541 pod/bin-false4e29c09d-34ac-42be-96aa-fe912766517d node/ci-op-jyv2v8ft-694a5-zcv8h-worker-0-6w2n6 container/bin-false4e29c09d-34ac-42be-96aa-fe912766517d init container exited with code 1 (Error): 
Sep 19 21:30:46.706 E ns/e2e-kubelet-test-8541 pod/bin-false4e29c09d-34ac-42be-96aa-fe912766517d node/ci-op-jyv2v8ft-694a5-zcv8h-worker-0-6w2n6 reason/Failed (): 
Sep 19 21:30:46.706 E ns/e2e-kubelet-test-8541 pod/bin-false4e29c09d-34ac-42be-96aa-fe912766517d node/ci-op-jyv2v8ft-694a5-zcv8h-worker-0-6w2n6 container/bin-false4e29c09d-34ac-42be-96aa-fe912766517d container exited with code 1 (Error): 
Sep 19 21:30:56.253 E ns/e2e-test-cli-deployment-wnvs4 pod/example-1-rpqfs node/ci-op-jyv2v8ft-694a5-zcv8h-worker-0-xccxs container/test container exited with code 137 (Error): 
Sep 19 21:31:18.688 E ns/e2e-test-image-change-build-trigger-zctms pod/sti-imagestreamtag-2-build node/ci-op-jyv2v8ft-694a5-zcv8h-worker-0-6w2n6 container/git-clone container exited with code 1 (Error): Cloning "git://github.com/openshift/ruby-hello-world.git" ...\n	Commit:	57073c041d103a412ff7d4a6e64b0ea7f77ea1b3 (Merge pull request #85 from wewang58/master)\n	Author:	Ben Parees <bparees@users.noreply.github.com>\n	Date:	Wed Nov 6 09:41:20 2019 -0500\nerror: provided context directory does not exist: contextimage\n
Sep 19 21:31:18.688 E ns/e2e-test-image-change-build-trigger-zctms pod/sti-imagestreamtag-2-build node/ci-op-jyv2v8ft-694a5-zcv8h-worker-0-6w2n6 reason/Failed (): 
Sep 19 21:31:18.688 E ns/e2e-test-image-change-build-trigger-zctms pod/sti-imagestreamtag-2-build node/ci-op-jyv2v8ft-694a5-zcv8h-worker-0-6w2n6 container/git-clone init container exited with code 1 (Error): Cloning "git://github.com/openshift/ruby-hello-world.git" ...\n	Commit:	57073c041d103a412ff7d4a6e64b0ea7f77ea1b3 (Merge pull request #85 from wewang58/master)\n	Author:	Ben Parees <bparees@users.noreply.github.com>\n	Date:	Wed Nov 6 09:41:20 2019 -0500\nerror: provided context directory does not exist: contextimage\n
Sep 19 21:31:18.702 E ns/e2e-test-image-change-build-trigger-zctms pod/sti-imagestreamtag-1-build node/ci-op-jyv2v8ft-694a5-zcv8h-worker-0-6w2n6 container/git-clone container exited with code 1 (Error): Cloning "git://github.com/openshift/ruby-hello-world.git" ...\n	Commit:	57073c041d103a412ff7d4a6e64b0ea7f77ea1b3 (Merge pull request #85 from wewang58/master)\n	Author:	Ben Parees <bparees@users.noreply.github.com>\n	Date:	Wed Nov 6 09:41:20 2019 -0500\nerror: provided context directory does not exist: contextimage\n
Sep 19 21:31:18.702 E ns/e2e-test-image-change-build-trigger-zctms pod/sti-imagestreamtag-1-build node/ci-op-jyv2v8ft-694a5-zcv8h-worker-0-6w2n6 reason/Failed (): 
Sep 19 21:31:18.702 E ns/e2e-test-image-change-build-trigger-zctms pod/sti-imagestreamtag-1-build node/ci-op-jyv2v8ft-694a5-zcv8h-worker-0-6w2n6 container/git-clone init container exited with code 1 (Error): Cloning "git://github.com/openshift/ruby-hello-world.git" ...\n	Commit:	57073c041d103a412ff7d4a6e64b0ea7f77ea1b3 (Merge pull request #85 from wewang58/master)\n	Author:	Ben Parees <bparees@users.noreply.github.com>\n	Date:	Wed Nov 6 09:41:20 2019 -0500\nerror: provided context directory does not exist: contextimage\n
Sep 19 21:31:19.587 E ns/e2e-network-policy-777 pod/client-a-9znmq node/ci-op-jyv2v8ft-694a5-zcv8h-worker-0-6w2n6 container/client init container exited with code 1 (Error): 
Sep 19 21:31:19.587 E ns/e2e-network-policy-777 pod/client-a-9znmq node/ci-op-jyv2v8ft-694a5-zcv8h-worker-0-6w2n6 reason/Failed (): 
Sep 19 21:31:19.587 E ns/e2e-network-policy-777 pod/client-a-9znmq node/ci-op-jyv2v8ft-694a5-zcv8h-worker-0-6w2n6 container/client container exited with code 1 (Error): 
Sep 19 21:31:54.040 E ns/e2e-kubectl-5811 pod/agnhost-primary-2fwqx node/ci-op-jyv2v8ft-694a5-zcv8h-worker-0-6w2n6 container/agnhost-primary container exited with code 2 (Error): 
Sep 19 21:32:10.235 E ns/e2e-network-policy-777 pod/client-b-9pctr node/ci-op-jyv2v8ft-694a5-zcv8h-worker-0-6w2n6 container/client init container exited with code 1 (Error): 
Sep 19 21:32:10.235 E ns/e2e-network-policy-777 pod/client-b-9pctr node/ci-op-jyv2v8ft-694a5-zcv8h-worker-0-6w2n6 reason/Failed (): 
Sep 19 21:32:10.235 E ns/e2e-network-policy-777 pod/client-b-9pctr node/ci-op-jyv2v8ft-694a5-zcv8h-worker-0-6w2n6 container/client container exited with code 1 (Error): 
Sep 19 21:32:11.743 E ns/e2e-volume-2202 pod/local-injector node/ci-op-jyv2v8ft-694a5-zcv8h-worker-0-xccxs container/local-injector container exited with code 137 (Error): 
Sep 19 21:32:27.845 E ns/e2e-volume-2202 pod/local-client node/ci-op-jyv2v8ft-694a5-zcv8h-worker-0-xccxs container/local-client container exited with code 137 (Error): 
Sep 19 21:32:28.859 E ns/e2e-provisioning-6538-6398 pod/csi-hostpathplugin-0 node/ci-op-jyv2v8ft-694a5-zcv8h-worker-0-xccxs container/liveness-probe container exited with code 2 (Error): 
Sep 19 21:32:28.859 E ns/e2e-provisioning-6538-6398 pod/csi-hostpathplugin-0 node/ci-op-jyv2v8ft-694a5-zcv8h-worker-0-xccxs container/node-driver-registrar container exited with code 2 (Error): 
Sep 19 21:32:28.860 E ns/e2e-provisioning-6538-6398 pod/csi-hostpath-provisioner-0 node/ci-op-jyv2v8ft-694a5-zcv8h-worker-0-xccxs container/csi-provisioner container exited with code 2 (Error): 
Sep 19 21:32:38.947 E ns/e2e-nettest-9560 pod/netserver-1 node/ci-op-jyv2v8ft-694a5-zcv8h-worker-0-xccxs container/webserver container exited with code 2 (Error): 
Sep 19 21:32:59.447 E ns/e2e-network-policy-777 pod/client-a-m6b8t node/ci-op-jyv2v8ft-694a5-zcv8h-worker-0-6w2n6 container/client init container exited with code 1 (Error): 
Sep 19 21:32:59.447 E ns/e2e-network-policy-777 pod/client-a-m6b8t node/ci-op-jyv2v8ft-694a5-zcv8h-worker-0-6w2n6 reason/Failed (): 
Sep 19 21:32:59.447 E ns/e2e-network-policy-777 pod/client-a-m6b8t node/ci-op-jyv2v8ft-694a5-zcv8h-worker-0-6w2n6 container/client container exited with code 1 (Error): 
Sep 19 21:33:24.772 E ns/e2e-volumemode-7450 pod/external-provisioner-bfjd6 node/ci-op-jyv2v8ft-694a5-zcv8h-worker-0-6w2n6 container/nfs-provisioner container exited with code 2 (Error): 
Sep 19 21:33:30.820 E ns/openshift-marketplace pod/community-operators-2sgjw node/ci-op-jyv2v8ft-694a5-zcv8h-worker-0-6w2n6 container/registry-server container exited with code 1 (Error): 
Sep 19 21:33:49.467 E ns/e2e-mount-propagation-4133 pod/master node/ci-op-jyv2v8ft-694a5-zcv8h-worker-0-xccxs container/cntr container exited with code 137 (Error): 
Sep 19 21:33:49.487 E ns/e2e-mount-propagation-4133 pod/private node/ci-op-jyv2v8ft-694a5-zcv8h-worker-0-xccxs container/cntr container exited with code 137 (Error): 
Sep 19 21:33:49.510 E ns/e2e-mount-propagation-4133 pod/default node/ci-op-jyv2v8ft-694a5-zcv8h-worker-0-xccxs container/cntr container exited with code 137 (Error): 
Sep 19 21:33:49.526 E ns/e2e-mount-propagation-4133 pod/slave node/ci-op-jyv2v8ft-694a5-zcv8h-worker-0-xccxs container/cntr container exited with code 137 (Error): 
Sep 19 21:34:13.594 E ns/e2e-pod-network-test-6016 pod/netserver-1 node/ci-op-jyv2v8ft-694a5-zcv8h-worker-0-xccxs container/webserver container exited with code 2 (Error): 
Sep 19 21:34:23.361 E ns/e2e-containers-2206 pod/client-containers-4abebbf4-d517-4ac9-ad14-845420d199c4 node/ci-op-jyv2v8ft-694a5-zcv8h-worker-0-6w2n6 container/test-container init container exited with code 2 (Error): 
Sep 19 21:34:23.361 E ns/e2e-containers-2206 pod/client-containers-4abebbf4-d517-4ac9-ad14-845420d199c4 node/ci-op-jyv2v8ft-694a5-zcv8h-worker-0-6w2n6 reason/Failed (): 
Sep 19 21:34:23.361 E ns/e2e-containers-2206 pod/client-containers-4abebbf4-d517-4ac9-ad14-845420d199c4 node/ci-op-jyv2v8ft-694a5-zcv8h-worker-0-6w2n6 container/test-container container exited with code 2 (Error): 
Sep 19 21:34:24.396 E ns/e2e-services-2259 pod/pod1 node/ci-op-jyv2v8ft-694a5-zcv8h-worker-0-6w2n6 container/pause container exited with code 2 (Error): 
Sep 19 21:34:25.811 E ns/e2e-services-2259 pod/pod2 node/ci-op-jyv2v8ft-694a5-zcv8h-worker-0-xccxs container/pause container exited with code 2 (Error): 
Sep 19 21:34:52.064 E ns/e2e-volume-expand-8103-4504 pod/csi-hostpath-attacher-0 node/ci-op-jyv2v8ft-694a5-zcv8h-worker-0-6w2n6 container/csi-attacher container exited with code 2 (Error): 
Sep 19 21:34:53.074 E ns/e2e-volume-expand-8103-4504 pod/csi-hostpath-snapshotter-0 node/ci-op-jyv2v8ft-694a5-zcv8h-worker-0-6w2n6 container/csi-snapshotter container exited with code 2 (Error): 
Sep 19 21:34:53.154 E ns/e2e-volume-expand-8103-4504 pod/csi-hostpath-resizer-0 node/ci-op-jyv2v8ft-694a5-zcv8h-worker-0-6w2n6 container/csi-resizer container exited with code 2 (Error): 
Sep 19 21:34:57.990 E ns/e2e-volume-5076 pod/local-injector node/ci-op-jyv2v8ft-694a5-zcv8h-worker-0-xccxs container/local-injector container exited with code 137 (Error): 
Sep 19 21:35:00.998 E ns/openshift-marketplace pod/community-operators-d5f8l node/ci-op-jyv2v8ft-694a5-zcv8h-worker-0-xccxs container/registry-server container exited with code 1 (Error): 
Sep 19 21:35:02.159 E ns/e2e-test-prometheus-d748m pod/execpodbt45d node/ci-op-jyv2v8ft-694a5-zcv8h-worker-0-6w2n6 container/agnhost-pause container exited with code 137 (Error): 
Sep 19 21:35:18.063 E ns/e2e-volume-5076 pod/local-client node/ci-op-jyv2v8ft-694a5-zcv8h-worker-0-xccxs container/local-client container exited with code 137 (Error): 
Sep 19 21:35:30.579 E ns/e2e-init-container-9744 pod/pod-init-ddef0fe9-a473-4ac4-95d2-b62ea6c2d6bb node/ci-op-jyv2v8ft-694a5-zcv8h-worker-0-6w2n6 container/init2 container exited with code 1 (Error): 
Sep 19 21:35:30.579 E ns/e2e-init-container-9744 pod/pod-init-ddef0fe9-a473-4ac4-95d2-b62ea6c2d6bb node/ci-op-jyv2v8ft-694a5-zcv8h-worker-0-6w2n6 reason/Failed (): 
Sep 19 21:35:30.579 E ns/e2e-init-container-9744 pod/pod-init-ddef0fe9-a473-4ac4-95d2-b62ea6c2d6bb node/ci-op-jyv2v8ft-694a5-zcv8h-worker-0-6w2n6 container/init2 init container exited with code 1 (Error): 
Sep 19 21:35:57.954 E ns/e2e-network-policy-3601 pod/client-c-fkztp node/ci-op-jyv2v8ft-694a5-zcv8h-worker-0-6w2n6 container/client init container exited with code 1 (Error): 
Sep 19 21:35:57.954 E ns/e2e-network-policy-3601 pod/client-c-fkztp node/ci-op-jyv2v8ft-694a5-zcv8h-worker-0-6w2n6 reason/Failed (): 
Sep 19 21:35:57.954 E ns/e2e-network-policy-3601 pod/client-c-fkztp node/ci-op-jyv2v8ft-694a5-zcv8h-worker-0-6w2n6 container/client container exited with code 1 (Error): 
Sep 19 21:36:45.467 E ns/e2e-services-2313 pod/kube-proxy-mode-detector node/ci-op-jyv2v8ft-694a5-zcv8h-worker-0-6w2n6 container/detector container exited with code 2 (Error): 
Sep 19 21:37:07.797 E ns/e2e-ephemeral-9444-4577 pod/csi-hostpath-resizer-0 node/ci-op-jyv2v8ft-694a5-zcv8h-worker-0-xccxs container/csi-resizer container exited with code 2 (Error): 
Sep 19 21:37:07.803 E ns/e2e-ephemeral-9444-4577 pod/csi-hostpath-snapshotter-0 node/ci-op-jyv2v8ft-694a5-zcv8h-worker-0-xccxs container/csi-snapshotter container exited with code 2 (Error): 
Sep 19 21:37:15.755 E ns/e2e-test-image-change-build-trigger-mphcz pod/docker-imagestreamtag-1-build node/ci-op-jyv2v8ft-694a5-zcv8h-worker-0-6w2n6 container/git-clone container exited with code 1 (Error): Cloning "git://github.com/openshift/ruby-hello-world.git" ...\n	Commit:	57073c041d103a412ff7d4a6e64b0ea7f77ea1b3 (Merge pull request #85 from wewang58/master)\n	Author:	Ben Parees <bparees@users.noreply.github.com>\n	Date:	Wed Nov 6 09:41:20 2019 -0500\nerror: provided context directory does not exist: contextimage\n
Sep 19 21:37:15.755 E ns/e2e-test-image-change-build-trigger-mphcz pod/docker-imagestreamtag-1-build node/ci-op-jyv2v8ft-694a5-zcv8h-worker-0-6w2n6 reason/Failed (): 
Sep 19 21:37:15.755 E ns/e2e-test-image-change-build-trigger-mphcz pod/docker-imagestreamtag-1-build node/ci-op-jyv2v8ft-694a5-zcv8h-worker-0-6w2n6 container/git-clone init container exited with code 1 (Error): Cloning "git://github.com/openshift/ruby-hello-world.git" ...\n	Commit:	57073c041d103a412ff7d4a6e64b0ea7f77ea1b3 (Merge pull request #85 from wewang58/master)\n	Author:	Ben Parees <bparees@users.noreply.github.com>\n	Date:	Wed Nov 6 09:41:20 2019 -0500\nerror: provided context directory does not exist: contextimage\n
Sep 19 21:37:17.794 E ns/e2e-test-image-change-build-trigger-mphcz pod/docker-imagestreamtag-2-build node/ci-op-jyv2v8ft-694a5-zcv8h-worker-0-6w2n6 container/git-clone container exited with code 1 (Error): Cloning "git://github.com/openshift/ruby-hello-world.git" ...\n	Commit:	57073c041d103a412ff7d4a6e64b0ea7f77ea1b3 (Merge pull request #85 from wewang58/master)\n	Author:	Ben Parees <bparees@users.noreply.github.com>\n	Date:	Wed Nov 6 09:41:20 2019 -0500\nerror: provided context directory does not exist: contextimage\n
Sep 19 21:37:17.794 E ns/e2e-test-image-change-build-trigger-mphcz pod/docker-imagestreamtag-2-build node/ci-op-jyv2v8ft-694a5-zcv8h-worker-0-6w2n6 reason/Failed (): 
Sep 19 21:37:17.794 E ns/e2e-test-image-change-build-trigger-mphcz pod/docker-imagestreamtag-2-build node/ci-op-jyv2v8ft-694a5-zcv8h-worker-0-6w2n6 container/git-clone init container exited with code 1 (Error): Cloning "git://github.com/openshift/ruby-hello-world.git" ...\n	Commit:	57073c041d103a412ff7d4a6e64b0ea7f77ea1b3 (Merge pull request #85 from wewang58/master)\n	Author:	Ben Parees <bparees@users.noreply.github.com>\n	Date:	Wed Nov 6 09:41:20 2019 -0500\nerror: provided context directory does not exist: contextimage\n
Sep 19 21:37:21.781 E ns/e2e-services-2313 pod/affinity-clusterip-timeout-p4fqk node/ci-op-jyv2v8ft-694a5-zcv8h-worker-0-6w2n6 container/affinity-clusterip-timeout container exited with code 137 (Error): 
Sep 19 21:37:28.829 E ns/e2e-downward-api-4897 pod/annotationupdate121ecdd2-7e05-465f-bf49-6b326b520868 node/ci-op-jyv2v8ft-694a5-zcv8h-worker-0-6w2n6 container/client-container init container exited with code 2 (Error): 
Sep 19 21:37:28.829 E ns/e2e-downward-api-4897 pod/annotationupdate121ecdd2-7e05-465f-bf49-6b326b520868 node/ci-op-jyv2v8ft-694a5-zcv8h-worker-0-6w2n6 reason/Failed (): 
Sep 19 21:37:28.829 E ns/e2e-downward-api-4897 pod/annotationupdate121ecdd2-7e05-465f-bf49-6b326b520868 node/ci-op-jyv2v8ft-694a5-zcv8h-worker-0-6w2n6 container/client-container container exited with code 2 (Error): 
Sep 19 21:37:48.939 E ns/e2e-provisioning-9812-3873 pod/csi-hostpath-attacher-0 node/ci-op-jyv2v8ft-694a5-zcv8h-worker-0-xccxs container/csi-attacher container exited with code 2 (Error): 
Sep 19 21:37:49.991 E ns/e2e-provisioning-9812-3873 pod/csi-hostpath-snapshotter-0 node/ci-op-jyv2v8ft-694a5-zcv8h-worker-0-xccxs container/csi-snapshotter container exited with code 2 (Error): 
Sep 19 21:37:52.269 E ns/e2e-provisioning-1902 pod/pod-subpath-test-inlinevolume-9qqx node/ci-op-jyv2v8ft-694a5-zcv8h-worker-0-6w2n6 container/test-container-volume-inlinevolume-9qqx init container exited with code 137 (Error): 
Sep 19 21:37:52.269 E ns/e2e-provisioning-1902 pod/pod-subpath-test-inlinevolume-9qqx node/ci-op-jyv2v8ft-694a5-zcv8h-worker-0-6w2n6 reason/Failed (): 
Sep 19 21:37:52.269 E ns/e2e-provisioning-1902 pod/pod-subpath-test-inlinevolume-9qqx node/ci-op-jyv2v8ft-694a5-zcv8h-worker-0-6w2n6 container/test-container-volume-inlinevolume-9qqx container exited with code 137 (Error): 
Sep 19 21:38:05.367 E ns/e2e-test-cli-deployment-6pv2h pod/deployment-simple-3-deploy node/ci-op-jyv2v8ft-694a5-zcv8h-worker-0-6w2n6 container/deployment init container exited with code 2 (Error): 
Sep 19 21:38:05.367 E ns/e2e-test-cli-deployment-6pv2h pod/deployment-simple-3-deploy node/ci-op-jyv2v8ft-694a5-zcv8h-worker-0-6w2n6 reason/Failed (): 
Sep 19 21:38:05.367 E ns/e2e-test-cli-deployment-6pv2h pod/deployment-simple-3-deploy node/ci-op-jyv2v8ft-694a5-zcv8h-worker-0-6w2n6 container/deployment container exited with code 2 (Error): 
Sep 19 21:38:12.393 E ns/e2e-test-cli-deployment-6pv2h pod/deployment-simple-4-deploy node/ci-op-jyv2v8ft-694a5-zcv8h-worker-0-6w2n6 container/deployment init container exited with code 2 (Error): 
Sep 19 21:38:12.393 E ns/e2e-test-cli-deployment-6pv2h pod/deployment-simple-4-deploy node/ci-op-jyv2v8ft-694a5-zcv8h-worker-0-6w2n6 reason/Failed (): 
Sep 19 21:38:12.393 E ns/e2e-test-cli-deployment-6pv2h pod/deployment-simple-4-deploy node/ci-op-jyv2v8ft-694a5-zcv8h-worker-0-6w2n6 container/deployment container exited with code 2 (Error): 
Sep 19 21:38:35.753 E ns/openshift-marketplace pod/community-operators-2sgjw node/ci-op-jyv2v8ft-694a5-zcv8h-worker-0-6w2n6 container/registry-server container exited with code 1 (Error): 
Sep 19 21:39:11.291 E ns/e2e-test-router-reencrypt-bnwff pod/execpod node/ci-op-jyv2v8ft-694a5-zcv8h-worker-0-6w2n6 container/agnhost container exited with code 2 (Error): 
Sep 19 21:39:20.541 E ns/e2e-volume-expand-6025-9532 pod/csi-hostpathplugin-0 node/ci-op-jyv2v8ft-694a5-zcv8h-worker-0-xccxs container/liveness-probe container exited with code 2 (Error): 
Sep 19 21:39:20.541 E ns/e2e-volume-expand-6025-9532 pod/csi-hostpathplugin-0 node/ci-op-jyv2v8ft-694a5-zcv8h-worker-0-xccxs container/node-driver-registrar container exited with code 2 (Error): 
Sep 19 21:39:20.544 E ns/e2e-volume-expand-6025-9532 pod/csi-hostpath-resizer-0 node/ci-op-jyv2v8ft-694a5-zcv8h-worker-0-xccxs container/csi-resizer container exited with code 2 (Error): 
Sep 19 21:39:20.562 E ns/e2e-volume-expand-6025-9532 pod/csi-hostpath-provisioner-0 node/ci-op-jyv2v8ft-694a5-zcv8h-worker-0-xccxs container/csi-provisioner container exited with code 2 (Error): 
Sep 19 21:39:37.819 E ns/e2e-test-image-change-build-trigger-jjqfb pod/docker-imagestreamtag-1-build node/ci-op-jyv2v8ft-694a5-zcv8h-worker-0-6w2n6 container/git-clone container exited with code 1 (Error): Cloning "git://github.com/openshift/ruby-hello-world.git" ...\n	Commit:	57073c041d103a412ff7d4a6e64b0ea7f77ea1b3 (Merge pull request #85 from wewang58/master)\n	Author:	Ben Parees <bparees@users.noreply.github.com>\n	Date:	Wed Nov 6 09:41:20 2019 -0500\nerror: provided context directory does not exist: contextimage\n
Sep 19 21:39:37.819 E ns/e2e-test-image-change-build-trigger-jjqfb pod/docker-imagestreamtag-1-build node/ci-op-jyv2v8ft-694a5-zcv8h-worker-0-6w2n6 reason/Failed (): 
Sep 19 21:39:37.819 E ns/e2e-test-image-change-build-trigger-jjqfb pod/docker-imagestreamtag-1-build node/ci-op-jyv2v8ft-694a5-zcv8h-worker-0-6w2n6 container/git-clone init container exited with code 1 (Error): Cloning "git://github.com/openshift/ruby-hello-world.git" ...\n	Commit:	57073c041d103a412ff7d4a6e64b0ea7f77ea1b3 (Merge pull request #85 from wewang58/master)\n	Author:	Ben Parees <bparees@users.noreply.github.com>\n	Date:	Wed Nov 6 09:41:20 2019 -0500\nerror: provided context directory does not exist: contextimage\n
Sep 19 21:39:38.817 E ns/e2e-test-image-change-build-trigger-jjqfb pod/docker-imagestreamtag-2-build node/ci-op-jyv2v8ft-694a5-zcv8h-worker-0-6w2n6 container/git-clone container exited with code 1 (Error): Cloning "git://github.com/openshift/ruby-hello-world.git" ...\n	Commit:	57073c041d103a412ff7d4a6e64b0ea7f77ea1b3 (Merge pull request #85 from wewang58/master)\n	Author:	Ben Parees <bparees@users.noreply.github.com>\n	Date:	Wed Nov 6 09:41:20 2019 -0500\nerror: provided context directory does not exist: contextimage\n
Sep 19 21:39:38.817 E ns/e2e-test-image-change-build-trigger-jjqfb pod/docker-imagestreamtag-2-build node/ci-op-jyv2v8ft-694a5-zcv8h-worker-0-6w2n6 reason/Failed (): 
Sep 19 21:39:38.817 E ns/e2e-test-image-change-build-trigger-jjqfb pod/docker-imagestreamtag-2-build node/ci-op-jyv2v8ft-694a5-zcv8h-worker-0-6w2n6 container/git-clone init container exited with code 1 (Error): Cloning "git://github.com/openshift/ruby-hello-world.git" ...\n	Commit:	57073c041d103a412ff7d4a6e64b0ea7f77ea1b3 (Merge pull request #85 from wewang58/master)\n	Author:	Ben Parees <bparees@users.noreply.github.com>\n	Date:	Wed Nov 6 09:41:20 2019 -0500\nerror: provided context directory does not exist: contextimage\n
Sep 19 21:39:49.912 E ns/e2e-kubectl-4189 pod/failure-1 node/ci-op-jyv2v8ft-694a5-zcv8h-worker-0-6w2n6 container/failure-1 init container exited with code 42 (Error): 
Sep 19 21:39:49.912 E ns/e2e-kubectl-4189 pod/failure-1 node/ci-op-jyv2v8ft-694a5-zcv8h-worker-0-6w2n6 reason/Failed (): 
Sep 19 21:39:49.912 E ns/e2e-kubectl-4189 pod/failure-1 node/ci-op-jyv2v8ft-694a5-zcv8h-worker-0-6w2n6 container/failure-1 container exited with code 42 (Error): 
Sep 19 21:39:54.995 E ns/e2e-kubectl-4189 pod/failure-2 node/ci-op-jyv2v8ft-694a5-zcv8h-worker-0-6w2n6 container/failure-2 container exited with code 42 (Error): 
Sep 19 21:40:04.165 E ns/e2e-sctp-5722 pod/kube-proxy-mode-detector node/ci-op-jyv2v8ft-694a5-zcv8h-worker-0-6w2n6 container/detector container exited with code 2 (Error): 
Sep 19 21:40:12.423 E ns/e2e-test-cli-deployment-d5gnz pod/deployment-simple-1-deploy node/ci-op-jyv2v8ft-694a5-zcv8h-worker-0-6w2n6 container/deployment init container exited with code 2 (Error): 
Sep 19 21:40:12.423 E ns/e2e-test-cli-deployment-d5gnz pod/deployment-simple-1-deploy node/ci-op-jyv2v8ft-694a5-zcv8h-worker-0-6w2n6 reason/Failed (): 
Sep 19 21:40:12.423 E ns/e2e-test-cli-deployment-d5gnz pod/deployment-simple-1-deploy node/ci-op-jyv2v8ft-694a5-zcv8h-worker-0-6w2n6 container/deployment container exited with code 2 (Error): 
Sep 19 21:40:16.929 E ns/openshift-marketplace pod/community-operators-d5f8l node/ci-op-jyv2v8ft-694a5-zcv8h-worker-0-xccxs container/registry-server container exited with code 1 (Error): 
Sep 19 21:40:24.565 E ns/e2e-test-cli-deployment-46xvz pod/deployment-simple-2-deploy node/ci-op-jyv2v8ft-694a5-zcv8h-worker-0-6w2n6 container/deployment init container exited with code 2 (Error): 
Sep 19 21:40:24.565 E ns/e2e-test-cli-deployment-46xvz pod/deployment-simple-2-deploy node/ci-op-jyv2v8ft-694a5-zcv8h-worker-0-6w2n6 reason/Failed (): 
Sep 19 21:40:24.565 E ns/e2e-test-cli-deployment-46xvz pod/deployment-simple-2-deploy node/ci-op-jyv2v8ft-694a5-zcv8h-worker-0-6w2n6 container/deployment container exited with code 2 (Error): 
Sep 19 21:40:43.802 E ns/e2e-kubelet-test-4950 pod/busybox-readonly-fs9048f14f-7af5-42ad-9dba-26aa5767c6cd node/ci-op-jyv2v8ft-694a5-zcv8h-worker-0-6w2n6 container/busybox-readonly-fs9048f14f-7af5-42ad-9dba-26aa5767c6cd init container exited with code 137 (Error): 
Sep 19 21:40:43.802 E ns/e2e-kubelet-test-4950 pod/busybox-readonly-fs9048f14f-7af5-42ad-9dba-26aa5767c6cd node/ci-op-jyv2v8ft-694a5-zcv8h-worker-0-6w2n6 reason/Failed (): 
Sep 19 21:40:43.802 E ns/e2e-kubelet-test-4950 pod/busybox-readonly-fs9048f14f-7af5-42ad-9dba-26aa5767c6cd node/ci-op-jyv2v8ft-694a5-zcv8h-worker-0-6w2n6 container/busybox-readonly-fs9048f14f-7af5-42ad-9dba-26aa5767c6cd container exited with code 137 (Error): 
Sep 19 21:40:46.790 E ns/e2e-test-cli-deployment-d5gnz pod/deployment-simple-1-s7hxt node/ci-op-jyv2v8ft-694a5-zcv8h-worker-0-6w2n6 container/myapp container exited with code 137 (Error): 
Sep 19 21:40:48.797 E ns/e2e-container-lifecycle-hook-5320 pod/pod-with-poststart-exec-hook node/ci-op-jyv2v8ft-694a5-zcv8h-worker-0-6w2n6 container/pod-with-poststart-exec-hook container exited with code 2 (Error): 
Sep 19 21:40:54.859 E ns/e2e-test-cli-deployment-d5gnz pod/deployment-simple-2-vg6kn node/ci-op-jyv2v8ft-694a5-zcv8h-worker-0-6w2n6 container/myapp container exited with code 137 (Error): 
Sep 19 21:40:58.879 E ns/e2e-kubectl-4189 pod/failure-3 node/ci-op-jyv2v8ft-694a5-zcv8h-worker-0-6w2n6 container/failure-3 container exited with code 42 (Error): 
Sep 19 21:41:10.457 E ns/e2e-snapshotting-6425-347 pod/csi-hostpath-snapshotter-0 node/ci-op-jyv2v8ft-694a5-zcv8h-worker-0-xccxs container/csi-snapshotter container exited with code 2 (Error): 
Sep 19 21:41:19.506 E ns/e2e-volumemode-5144-9811 pod/csi-hostpath-attacher-0 node/ci-op-jyv2v8ft-694a5-zcv8h-worker-0-xccxs container/csi-attacher container exited with code 2 (Error): 
Sep 19 21:41:20.568 E ns/e2e-volumemode-5144-9811 pod/csi-hostpath-snapshotter-0 node/ci-op-jyv2v8ft-694a5-zcv8h-worker-0-xccxs container/csi-snapshotter container exited with code 2 (Error): 
Sep 19 21:41:35.162 E ns/e2e-net-services1-3987 pod/service-q9xjn node/ci-op-jyv2v8ft-694a5-zcv8h-worker-0-6w2n6 container/service-q9xjn-container init container exited with code 2 (Error): 
Sep 19 21:41:35.162 E ns/e2e-net-services1-3987 pod/service-q9xjn node/ci-op-jyv2v8ft-694a5-zcv8h-worker-0-6w2n6 reason/Failed (): 
Sep 19 21:41:35.162 E ns/e2e-net-services1-3987 pod/service-q9xjn node/ci-op-jyv2v8ft-694a5-zcv8h-worker-0-6w2n6 container/service-q9xjn-container container exited with code 2 (Error): 
Sep 19 21:41:43.694 E ns/e2e-test-image-change-build-trigger-n7hwc pod/multi-image-trigger-1-build node/ci-op-jyv2v8ft-694a5-zcv8h-worker-0-xccxs container/git-clone container exited with code 1 (Error): Cloning "git://github.com/openshift/ruby-hello-world.git" ...\n	Commit:	57073c041d103a412ff7d4a6e64b0ea7f77ea1b3 (Merge pull request #85 from wewang58/master)\n	Author:	Ben Parees <bparees@users.noreply.github.com>\n	Date:	Wed Nov 6 09:41:20 2019 -0500\nerror: provided context directory does not exist: contextimage\n
Sep 19 21:41:43.694 E ns/e2e-test-image-change-build-trigger-n7hwc pod/multi-image-trigger-1-build node/ci-op-jyv2v8ft-694a5-zcv8h-worker-0-xccxs reason/Failed (): 
Sep 19 21:41:43.694 E ns/e2e-test-image-change-build-trigger-n7hwc pod/multi-image-trigger-1-build node/ci-op-jyv2v8ft-694a5-zcv8h-worker-0-xccxs container/git-clone init container exited with code 1 (Error): Cloning "git://github.com/openshift/ruby-hello-world.git" ...\n	Commit:	57073c041d103a412ff7d4a6e64b0ea7f77ea1b3 (Merge pull request #85 from wewang58/master)\n	Author:	Ben Parees <bparees@users.noreply.github.com>\n	Date:	Wed Nov 6 09:41:20 2019 -0500\nerror: provided context directory does not exist: contextimage\n
Sep 19 21:41:45.711 E ns/e2e-test-image-change-build-trigger-n7hwc pod/multi-image-trigger-2-build node/ci-op-jyv2v8ft-694a5-zcv8h-worker-0-xccxs container/git-clone container exited with code 1 (Error): Cloning "git://github.com/openshift/ruby-hello-world.git" ...\n	Commit:	57073c041d103a412ff7d4a6e64b0ea7f77ea1b3 (Merge pull request #85 from wewang58/master)\n	Author:	Ben Parees <bparees@users.noreply.github.com>\n	Date:	Wed Nov 6 09:41:20 2019 -0500\nerror: provided context directory does not exist: contextimage\n
Sep 19 21:41:45.711 E ns/e2e-test-image-change-build-trigger-n7hwc pod/multi-image-trigger-2-build node/ci-op-jyv2v8ft-694a5-zcv8h-worker-0-xccxs reason/Failed (): 
Sep 19 21:41:45.711 E ns/e2e-test-image-change-build-trigger-n7hwc pod/multi-image-trigger-2-build node/ci-op-jyv2v8ft-694a5-zcv8h-worker-0-xccxs container/git-clone init container exited with code 1 (Error): Cloning "git://github.com/openshift/ruby-hello-world.git" ...\n	Commit:	57073c041d103a412ff7d4a6e64b0ea7f77ea1b3 (Merge pull request #85 from wewang58/master)\n	Author:	Ben Parees <bparees@users.noreply.github.com>\n	Date:	Wed Nov 6 09:41:20 2019 -0500\nerror: provided context directory does not exist: contextimage\n
Sep 19 21:41:48.992 E ns/e2e-test-image-change-build-trigger-n7hwc pod/multi-image-trigger-3-build node/ci-op-jyv2v8ft-694a5-zcv8h-worker-0-6w2n6 container/git-clone init container exited with code 137 (ContainerStatusUnknown): The container could not be located when the pod was terminated
Sep 19 21:41:51.285 E ns/e2e-test-router-config-manager-99k5d pod/insecure-endpoint node/ci-op-jyv2v8ft-694a5-zcv8h-worker-0-6w2n6 container/test container exited with code 1 (Error): 
Sep 19 21:41:54.784 E ns/e2e-test-router-config-manager-99k5d pod/router-haproxy-cfgmgr node/ci-op-jyv2v8ft-694a5-zcv8h-worker-0-xccxs container/router container exited with code 137 (Error): 
Sep 19 21:42:04.505 E ns/e2e-kubectl-6156 pod/update-demo-nautilus-x7tr6 node/ci-op-jyv2v8ft-694a5-zcv8h-worker-0-6w2n6 container/update-demo container exited with code 2 (Error): 
Sep 19 21:42:19.861 E ns/e2e-kubectl-6156 pod/update-demo-nautilus-sj59h node/ci-op-jyv2v8ft-694a5-zcv8h-worker-0-xccxs container/update-demo container exited with code 2 (Error): 
Sep 19 21:42:32.922 E ns/e2e-kubectl-4189 pod/failure-4 node/ci-op-jyv2v8ft-694a5-zcv8h-worker-0-6w2n6 container/failure-4 init container exited with code 42 (Error): 
Sep 19 21:42:32.922 E ns/e2e-kubectl-4189 pod/failure-4 node/ci-op-jyv2v8ft-694a5-zcv8h-worker-0-6w2n6 reason/Failed (): 
Sep 19 21:42:32.922 E ns/e2e-kubectl-4189 pod/failure-4 node/ci-op-jyv2v8ft-694a5-zcv8h-worker-0-6w2n6 container/failure-4 container exited with code 42 (Error): 
Sep 19 21:42:50.391 E ns/e2e-test-build-webhooks-g9sqf pod/pushbuild-2-build node/ci-op-jyv2v8ft-694a5-zcv8h-worker-0-6w2n6 container/git-clone container exited with code 1 (Error): Cloning "http://my.docker/build" ...\nerror: fatal: unable to access 'http://my.docker/build/': Could not resolve host: my.docker\n
Sep 19 21:42:50.391 E ns/e2e-test-build-webhooks-g9sqf pod/pushbuild-2-build node/ci-op-jyv2v8ft-694a5-zcv8h-worker-0-6w2n6 reason/Failed (): 
Sep 19 21:42:50.391 E ns/e2e-test-build-webhooks-g9sqf pod/pushbuild-2-build node/ci-op-jyv2v8ft-694a5-zcv8h-worker-0-6w2n6 container/git-clone init container exited with code 1 (Error): Cloning "http://my.docker/build" ...\nerror: fatal: unable to access 'http://my.docker/build/': Could not resolve host: my.docker\n
Sep 19 21:42:51.415 E ns/e2e-test-build-webhooks-g9sqf pod/pushbuild-1-build node/ci-op-jyv2v8ft-694a5-zcv8h-worker-0-6w2n6 container/git-clone container exited with code 1 (Error): Cloning "http://my.docker/build" ...\nerror: fatal: unable to access 'http://my.docker/build/': Could not resolve host: my.docker\n
Sep 19 21:42:51.415 E ns/e2e-test-build-webhooks-g9sqf pod/pushbuild-1-build node/ci-op-jyv2v8ft-694a5-zcv8h-worker-0-6w2n6 reason/Failed (): 
Sep 19 21:42:51.415 E ns/e2e-test-build-webhooks-g9sqf pod/pushbuild-1-build node/ci-op-jyv2v8ft-694a5-zcv8h-worker-0-6w2n6 container/git-clone init container exited with code 1 (Error): Cloning "http://my.docker/build" ...\nerror: fatal: unable to access 'http://my.docker/build/': Could not resolve host: my.docker\n
Sep 19 21:42:51.468 E ns/e2e-test-build-webhooks-g9sqf pod/pushbuild-3-build node/ci-op-jyv2v8ft-694a5-zcv8h-worker-0-6w2n6 container/git-clone container exited with code 1 (Error): Cloning "http://my.docker/build" ...\nerror: fatal: unable to access 'http://my.docker/build/': Could not resolve host: my.docker\n
Sep 19 21:42:51.468 E ns/e2e-test-build-webhooks-g9sqf pod/pushbuild-3-build node/ci-op-jyv2v8ft-694a5-zcv8h-worker-0-6w2n6 reason/Failed (): 
Sep 19 21:42:51.468 E ns/e2e-test-build-webhooks-g9sqf pod/pushbuild-3-build node/ci-op-jyv2v8ft-694a5-zcv8h-worker-0-6w2n6 container/git-clone init container exited with code 1 (Error): Cloning "http://my.docker/build" ...\nerror: fatal: unable to access 'http://my.docker/build/': Could not resolve host: my.docker\n
Sep 19 21:42:52.469 E ns/e2e-test-build-webhooks-g9sqf pod/pushbuild-4-build node/ci-op-jyv2v8ft-694a5-zcv8h-worker-0-6w2n6 container/git-clone container exited with code 1 (Error): Cloning "http://my.docker/build" ...\nerror: fatal: unable to access 'http://my.docker/build/': Could not resolve host: my.docker\n
Sep 19 21:42:52.469 E ns/e2e-test-build-webhooks-g9sqf pod/pushbuild-4-build node/ci-op-jyv2v8ft-694a5-zcv8h-worker-0-6w2n6 reason/Failed (): 
Sep 19 21:42:52.469 E ns/e2e-test-build-webhooks-g9sqf pod/pushbuild-4-build node/ci-op-jyv2v8ft-694a5-zcv8h-worker-0-6w2n6 container/git-clone init container exited with code 1 (Error): Cloning "http://my.docker/build" ...\nerror: fatal: unable to access 'http://my.docker/build/': Could not resolve host: my.docker\n
Sep 19 21:43:28.634 E ns/e2e-network-policy-6664 pod/client-a-dkbqz node/ci-op-jyv2v8ft-694a5-zcv8h-worker-0-6w2n6 container/client init container exited with code 1 (Error): 
Sep 19 21:43:28.634 E ns/e2e-network-policy-6664 pod/client-a-dkbqz node/ci-op-jyv2v8ft-694a5-zcv8h-worker-0-6w2n6 reason/Failed (): 
Sep 19 21:43:28.634 E ns/e2e-network-policy-6664 pod/client-a-dkbqz node/ci-op-jyv2v8ft-694a5-zcv8h-worker-0-6w2n6 container/client container exited with code 1 (Error): 
Sep 19 21:43:41.689 E ns/openshift-marketplace pod/community-operators-2sgjw node/ci-op-jyv2v8ft-694a5-zcv8h-worker-0-6w2n6 container/registry-server container exited with code 1 (Error): 
Sep 19 21:44:17.495 E ns/e2e-network-policy-6664 pod/client-b-csv4p node/ci-op-jyv2v8ft-694a5-zcv8h-worker-0-xccxs container/client init container exited with code 1 (Error): 
Sep 19 21:44:17.495 E ns/e2e-network-policy-6664 pod/client-b-csv4p node/ci-op-jyv2v8ft-694a5-zcv8h-worker-0-xccxs reason/Failed (): 
Sep 19 21:44:17.495 E ns/e2e-network-policy-6664 pod/client-b-csv4p node/ci-op-jyv2v8ft-694a5-zcv8h-worker-0-xccxs container/client container exited with code 1 (Error): 
Sep 19 21:44:34.820 E ns/e2e-services-3182 pod/affinity-clusterip-transition-kf2j8 node/ci-op-jyv2v8ft-694a5-zcv8h-worker-0-xccxs container/affinity-clusterip-transition container exited with code 137 (Error): 
Sep 19 21:44:40.494 E ns/e2e-test-cli-deployment-lbw42 pod/deployment-simple-1-hook-pre node/ci-op-jyv2v8ft-694a5-zcv8h-worker-0-6w2n6 container/lifecycle init container exited with code 1 (Error): 
Sep 19 21:44:40.494 E ns/e2e-test-cli-deployment-lbw42 pod/deployment-simple-1-hook-pre node/ci-op-jyv2v8ft-694a5-zcv8h-worker-0-6w2n6 reason/Failed (): 
Sep 19 21:44:40.494 E ns/e2e-test-cli-deployment-lbw42 pod/deployment-simple-1-hook-pre node/ci-op-jyv2v8ft-694a5-zcv8h-worker-0-6w2n6 container/lifecycle container exited with code 1 (Error): 
Sep 19 21:44:41.490 E ns/e2e-test-cli-deployment-lbw42 pod/deployment-simple-1-deploy node/ci-op-jyv2v8ft-694a5-zcv8h-worker-0-6w2n6 container/deployment init container exited with code 1 (Error): 
Sep 19 21:44:41.490 E ns/e2e-test-cli-deployment-lbw42 pod/deployment-simple-1-deploy node/ci-op-jyv2v8ft-694a5-zcv8h-worker-0-6w2n6 reason/Failed (): 
Sep 19 21:44:41.490 E ns/e2e-test-cli-deployment-lbw42 pod/deployment-simple-1-deploy node/ci-op-jyv2v8ft-694a5-zcv8h-worker-0-6w2n6 container/deployment container exited with code 1 (Error): 
Sep 19 21:44:41.874 E ns/e2e-csi-mock-volumes-8386-4364 pod/csi-mockplugin-attacher-0 node/ci-op-jyv2v8ft-694a5-zcv8h-worker-0-xccxs container/csi-attacher container exited with code 255 (Error): Lost connection to CSI driver, exiting
Sep 19 21:45:15.070 E ns/e2e-volume-1211 pod/local-injector node/ci-op-jyv2v8ft-694a5-zcv8h-worker-0-xccxs container/local-injector container exited with code 137 (Error): 
Sep 19 21:45:20.773 E ns/e2e-network-policy-b-7725 pod/client-b-sdgbj node/ci-op-jyv2v8ft-694a5-zcv8h-worker-0-6w2n6 container/client init container exited with code 1 (Error): 
Sep 19 21:45:20.773 E ns/e2e-network-policy-b-7725 pod/client-b-sdgbj node/ci-op-jyv2v8ft-694a5-zcv8h-worker-0-6w2n6 reason/Failed (): 
Sep 19 21:45:20.773 E ns/e2e-network-policy-b-7725 pod/client-b-sdgbj node/ci-op-jyv2v8ft-694a5-zcv8h-worker-0-6w2n6 container/client container exited with code 1 (Error): 
Sep 19 21:45:22.865 E ns/e2e-network-policy-6664 pod/server-z2rb9 node/ci-op-jyv2v8ft-694a5-zcv8h-worker-0-6w2n6 container/server-container-80 init container exited with code 2 (Error): 
Sep 19 21:45:22.865 E ns/e2e-network-policy-6664 pod/server-z2rb9 node/ci-op-jyv2v8ft-694a5-zcv8h-worker-0-6w2n6 container/server-container-81 init container exited with code 2 (Error): 
Sep 19 21:45:22.865 E ns/e2e-network-policy-6664 pod/server-z2rb9 node/ci-op-jyv2v8ft-694a5-zcv8h-worker-0-6w2n6 reason/Failed (): 
Sep 19 21:45:22.865 E ns/e2e-network-policy-6664 pod/server-z2rb9 node/ci-op-jyv2v8ft-694a5-zcv8h-worker-0-6w2n6 container/server-container-81 container exited with code 2 (Error): 
Sep 19 21:45:22.865 E ns/e2e-network-policy-6664 pod/server-z2rb9 node/ci-op-jyv2v8ft-694a5-zcv8h-worker-0-6w2n6 container/server-container-80 container exited with code 2 (Error): 
Sep 19 21:45:29.111 E ns/openshift-marketplace pod/community-operators-d5f8l node/ci-op-jyv2v8ft-694a5-zcv8h-worker-0-xccxs container/registry-server container exited with code 1 (Error): 
Sep 19 21:45:41.209 E ns/e2e-csi-mock-volumes-2278-2749 pod/csi-mockplugin-attacher-0 node/ci-op-jyv2v8ft-694a5-zcv8h-worker-0-xccxs container/csi-attacher container exited with code 255 (Error): Lost connection to CSI driver, exiting
Sep 19 21:45:55.307 E ns/e2e-test-prometheus-8g44c pod/execpod79n8v node/ci-op-jyv2v8ft-694a5-zcv8h-worker-0-6w2n6 container/agnhost-pause container exited with code 137 (Error): 
Sep 19 21:46:13.407 E ns/e2e-services-1807 pod/kube-proxy-mode-detector node/ci-op-jyv2v8ft-694a5-zcv8h-worker-0-xccxs container/detector container exited with code 2 (Error): 
Sep 19 21:46:16.538 E ns/e2e-test-cli-deployment-7pxkn pod/history-limit-5-f2l5h node/ci-op-jyv2v8ft-694a5-zcv8h-worker-0-6w2n6 container/myapp container exited with code 137 (Error): 
Sep 19 21:46:27.727 E ns/e2e-test-cli-deployment-7pxkn pod/history-limit-6-qpln6 node/ci-op-jyv2v8ft-694a5-zcv8h-worker-0-6w2n6 container/myapp container exited with code 137 (Error): 
Sep 19 21:46:38.739 E ns/e2e-test-cli-deployment-7pxkn pod/history-limit-7-8q27j node/ci-op-jyv2v8ft-694a5-zcv8h-worker-0-6w2n6 container/myapp container exited with code 137 (Error): 
Sep 19 21:46:54.830 E ns/e2e-services-1807 pod/affinity-nodeport-timeout-pq4g6 node/ci-op-jyv2v8ft-694a5-zcv8h-worker-0-xccxs container/affinity-nodeport-timeout container exited with code 137 (Error): 
Sep 19 21:46:54.889 E ns/e2e-services-1807 pod/affinity-nodeport-timeout-czdsj node/ci-op-jyv2v8ft-694a5-zcv8h-worker-0-xccxs container/affinity-nodeport-timeout container exited with code 137 (Error): 
Sep 19 21:46:54.997 E ns/e2e-test-templates-7bdkv pod/simple-example-1-build node/ci-op-jyv2v8ft-694a5-zcv8h-worker-0-6w2n6 container/git-clone container exited with code 1 (Error): Cloning "https://bad" ...\nerror: fatal: unable to access 'https://bad/': Could not resolve host: bad\n
Sep 19 21:46:54.997 E ns/e2e-test-templates-7bdkv pod/simple-example-1-build node/ci-op-jyv2v8ft-694a5-zcv8h-worker-0-6w2n6 reason/Failed (): 
Sep 19 21:46:54.997 E ns/e2e-test-templates-7bdkv pod/simple-example-1-build node/ci-op-jyv2v8ft-694a5-zcv8h-worker-0-6w2n6 container/git-clone init container exited with code 1 (Error): Cloning "https://bad" ...\nerror: fatal: unable to access 'https://bad/': Could not resolve host: bad\n
Sep 19 21:47:07.140 E ns/e2e-cronjob-7708 pod/failed-jobs-history-limit-1600552020-lj8m9 node/ci-op-jyv2v8ft-694a5-zcv8h-worker-0-6w2n6 container/c container exited with code 1 (Error): 
Sep 19 21:47:12.009 E ns/e2e-provisioning-9735 pod/pod-subpath-test-preprovisionedpv-b9hs node/ci-op-jyv2v8ft-694a5-zcv8h-worker-0-xccxs container/test-container-volume-preprovisionedpv-b9hs init container exited with code 137 (Error): 
Sep 19 21:47:12.009 E ns/e2e-provisioning-9735 pod/pod-subpath-test-preprovisionedpv-b9hs node/ci-op-jyv2v8ft-694a5-zcv8h-worker-0-xccxs reason/Failed (): 
Sep 19 21:47:12.009 E ns/e2e-provisioning-9735 pod/pod-subpath-test-preprovisionedpv-b9hs node/ci-op-jyv2v8ft-694a5-zcv8h-worker-0-xccxs container/test-container-volume-preprovisionedpv-b9hs container exited with code 137 (Error): 
Sep 19 21:47:55.644 E ns/e2e-kubectl-4283 pod/agnhost-primary-wdhhd node/ci-op-jyv2v8ft-694a5-zcv8h-worker-0-6w2n6 container/agnhost-primary container exited with code 2 (Error): 
Sep 19 21:48:04.746 E ns/e2e-projected-953 pod/pod-projected-configmaps-eca5f864-e997-4151-a06f-ea556413472b node/ci-op-jyv2v8ft-694a5-zcv8h-worker-0-6w2n6 container/projected-configmap-volume-test init container exited with code 2 (Error): 
Sep 19 21:48:04.746 E ns/e2e-projected-953 pod/pod-projected-configmaps-eca5f864-e997-4151-a06f-ea556413472b node/ci-op-jyv2v8ft-694a5-zcv8h-worker-0-6w2n6 reason/Failed (): 
Sep 19 21:48:04.746 E ns/e2e-projected-953 pod/pod-projected-configmaps-eca5f864-e997-4151-a06f-ea556413472b node/ci-op-jyv2v8ft-694a5-zcv8h-worker-0-6w2n6 container/projected-configmap-volume-test container exited with code 2 (Error): 
Sep 19 21:48:07.750 E ns/e2e-cronjob-7708 pod/failed-jobs-history-limit-1600552080-8zrbk node/ci-op-jyv2v8ft-694a5-zcv8h-worker-0-6w2n6 container/c container exited with code 1 (Error): 
Sep 19 21:48:52.045 E ns/openshift-marketplace pod/community-operators-2sgjw node/ci-op-jyv2v8ft-694a5-zcv8h-worker-0-6w2n6 container/registry-server container exited with code 1 (Error): 
Sep 19 21:49:45.329 E ns/e2e-volume-4387 pod/gluster-injector node/ci-op-jyv2v8ft-694a5-zcv8h-worker-0-6w2n6 container/gluster-injector container exited with code 137 (Error): 
Sep 19 21:49:59.408 E ns/e2e-volume-4387 pod/gluster-client node/ci-op-jyv2v8ft-694a5-zcv8h-worker-0-6w2n6 container/gluster-client container exited with code 137 (Error): 
Sep 19 21:50:33.246 E ns/openshift-marketplace pod/community-operators-d5f8l node/ci-op-jyv2v8ft-694a5-zcv8h-worker-0-xccxs container/registry-server container exited with code 1 (Error): 
Sep 19 21:52:08.594 E ns/e2e-network-policy-4877 pod/client-b-xdcs9 node/ci-op-jyv2v8ft-694a5-zcv8h-worker-0-6w2n6 container/client init container exited with code 1 (Error): 
Sep 19 21:52:08.594 E ns/e2e-network-policy-4877 pod/client-b-xdcs9 node/ci-op-jyv2v8ft-694a5-zcv8h-worker-0-6w2n6 reason/Failed (): 
Sep 19 21:52:08.594 E ns/e2e-network-policy-4877 pod/client-b-xdcs9 node/ci-op-jyv2v8ft-694a5-zcv8h-worker-0-6w2n6 container/client container exited with code 1 (Error): 
Sep 19 21:52:35.811 E ns/e2e-volume-expand-6326-2891 pod/csi-hostpath-attacher-0 node/ci-op-jyv2v8ft-694a5-zcv8h-worker-0-xccxs container/csi-attacher container exited with code 2 (Error): 
Sep 19 21:52:36.901 E ns/e2e-volume-expand-6326-2891 pod/csi-hostpath-snapshotter-0 node/ci-op-jyv2v8ft-694a5-zcv8h-worker-0-xccxs container/csi-snapshotter container exited with code 2 (Error): 
Sep 19 21:52:36.917 E ns/e2e-volume-expand-6326-2891 pod/csi-hostpath-resizer-0 node/ci-op-jyv2v8ft-694a5-zcv8h-worker-0-xccxs container/csi-resizer container exited with code 2 (Error): 
Sep 19 21:52:41.865 E ns/e2e-test-cli-deployment-rl7tc pod/readiness-1-deploy node/ci-op-jyv2v8ft-694a5-zcv8h-worker-0-6w2n6 container/deployment init container exited with code 1 (Error): 
Sep 19 21:52:41.865 E ns/e2e-test-cli-deployment-rl7tc pod/readiness-1-deploy node/ci-op-jyv2v8ft-694a5-zcv8h-worker-0-6w2n6 reason/Failed (): 
Sep 19 21:52:41.865 E ns/e2e-test-cli-deployment-rl7tc pod/readiness-1-deploy node/ci-op-jyv2v8ft-694a5-zcv8h-worker-0-6w2n6 container/deployment container exited with code 1 (Error): 
Sep 19 21:52:41.885 E ns/e2e-volume-8757 pod/nfs-injector node/ci-op-jyv2v8ft-694a5-zcv8h-worker-0-6w2n6 container/nfs-injector container exited with code 137 (Error): 
Sep 19 21:52:57.975 E ns/e2e-network-policy-b-596 pod/client-a-vz4ld node/ci-op-jyv2v8ft-694a5-zcv8h-worker-0-6w2n6 container/client init container exited with code 1 (Error): 
Sep 19 21:52:57.975 E ns/e2e-network-policy-b-596 pod/client-a-vz4ld node/ci-op-jyv2v8ft-694a5-zcv8h-worker-0-6w2n6 reason/Failed (): 
Sep 19 21:52:57.975 E ns/e2e-network-policy-b-596 pod/client-a-vz4ld node/ci-op-jyv2v8ft-694a5-zcv8h-worker-0-6w2n6 container/client container exited with code 1 (Error): 
Sep 19 21:52:57.978 E ns/e2e-volume-8757 pod/nfs-client node/ci-op-jyv2v8ft-694a5-zcv8h-worker-0-xccxs container/nfs-client container exited with code 137 (Error): 
Sep 19 21:52:59.039 E ns/e2e-provisioning-7264 pod/pod-subpath-test-preprovisionedpv-426r node/ci-op-jyv2v8ft-694a5-zcv8h-worker-0-xccxs container/test-container-volume-preprovisionedpv-426r init container exited with code 137 (Error): 
Sep 19 21:52:59.039 E ns/e2e-provisioning-7264 pod/pod-subpath-test-preprovisionedpv-426r node/ci-op-jyv2v8ft-694a5-zcv8h-worker-0-xccxs reason/Failed (): 
Sep 19 21:52:59.039 E ns/e2e-provisioning-7264 pod/pod-subpath-test-preprovisionedpv-426r node/ci-op-jyv2v8ft-694a5-zcv8h-worker-0-xccxs container/test-container-volume-preprovisionedpv-426r container exited with code 137 (Error): 
Sep 19 21:53:13.136 E ns/e2e-test-cli-deployment-rl7tc pod/readiness-1-7gjgw node/ci-op-jyv2v8ft-694a5-zcv8h-worker-0-xccxs container/never-ready container exited with code 137 (Error): 
Sep 19 21:53:20.254 E ns/e2e-volume-8757 pod/external-provisioner-g2pm5 node/ci-op-jyv2v8ft-694a5-zcv8h-worker-0-6w2n6 container/nfs-provisioner container exited with code 2 (Error): 
Sep 19 21:53:51.647 E ns/e2e-network-policy-4837 pod/client-cannot-connect-kvzb8 node/ci-op-jyv2v8ft-694a5-zcv8h-worker-0-6w2n6 container/client init container exited with code 1 (Error): 
Sep 19 21:53:51.647 E ns/e2e-network-policy-4837 pod/client-cannot-connect-kvzb8 node/ci-op-jyv2v8ft-694a5-zcv8h-worker-0-6w2n6 reason/Failed (): 
Sep 19 21:53:51.647 E ns/e2e-network-policy-4837 pod/client-cannot-connect-kvzb8 node/ci-op-jyv2v8ft-694a5-zcv8h-worker-0-6w2n6 container/client container exited with code 1 (Error): 
Sep 19 21:53:58.820 E ns/openshift-marketplace pod/community-operators-2sgjw node/ci-op-jyv2v8ft-694a5-zcv8h-worker-0-6w2n6 container/registry-server container exited with code 1 (Error): 
Sep 19 21:54:01.437 E ns/e2e-snapshotting-7011-1001 pod/csi-hostpath-provisioner-0 node/ci-op-jyv2v8ft-694a5-zcv8h-worker-0-xccxs container/csi-provisioner container exited with code 2 (Error): 
Sep 19 21:54:01.616 E ns/e2e-snapshotting-7011-1001 pod/csi-hostpathplugin-0 node/ci-op-jyv2v8ft-694a5-zcv8h-worker-0-xccxs container/node-driver-registrar container exited with code 2 (Error): 
Sep 19 21:54:01.616 E ns/e2e-snapshotting-7011-1001 pod/csi-hostpathplugin-0 node/ci-op-jyv2v8ft-694a5-zcv8h-worker-0-xccxs container/liveness-probe container exited with code 2 (Error): 
Sep 19 21:54:15.766 E ns/e2e-ephemeral-5464-8723 pod/csi-hostpathplugin-0 node/ci-op-jyv2v8ft-694a5-zcv8h-worker-0-xccxs container/liveness-probe container exited with code 2 (Error): 
Sep 19 21:54:15.766 E ns/e2e-ephemeral-5464-8723 pod/csi-hostpathplugin-0 node/ci-op-jyv2v8ft-694a5-zcv8h-worker-0-xccxs container/node-driver-registrar container exited with code 2 (Error): 
Sep 19 21:54:33.935 E ns/e2e-port-forwarding-6440 pod/pfpod node/ci-op-jyv2v8ft-694a5-zcv8h-worker-0-xccxs container/readiness init container exited with code 2 (Error): 
Sep 19 21:54:33.935 E ns/e2e-port-forwarding-6440 pod/pfpod node/ci-op-jyv2v8ft-694a5-zcv8h-worker-0-xccxs reason/Failed (): 
Sep 19 21:54:33.935 E ns/e2e-port-forwarding-6440 pod/pfpod node/ci-op-jyv2v8ft-694a5-zcv8h-worker-0-xccxs container/readiness container exited with code 2 (Error): 
Sep 19 21:55:37.265 E ns/openshift-marketplace pod/community-operators-d5f8l node/ci-op-jyv2v8ft-694a5-zcv8h-worker-0-xccxs container/registry-server container exited with code 1 (Error): 
Sep 19 21:56:27.737 E ns/e2e-provisioning-4681 pod/pod-subpath-test-preprovisionedpv-pg5l node/ci-op-jyv2v8ft-694a5-zcv8h-worker-0-xccxs container/test-container-volume-preprovisionedpv-pg5l init container exited with code 137 (Error): 
Sep 19 21:56:27.737 E ns/e2e-provisioning-4681 pod/pod-subpath-test-preprovisionedpv-pg5l node/ci-op-jyv2v8ft-694a5-zcv8h-worker-0-xccxs reason/Failed (): 
Sep 19 21:56:27.737 E ns/e2e-provisioning-4681 pod/pod-subpath-test-preprovisionedpv-pg5l node/ci-op-jyv2v8ft-694a5-zcv8h-worker-0-xccxs container/test-container-volume-preprovisionedpv-pg5l container exited with code 137 (Error): 
Sep 19 21:56:34.819 E ns/e2e-services-8927 pod/affinity-clusterip-m648d node/ci-op-jyv2v8ft-694a5-zcv8h-worker-0-xccxs container/affinity-clusterip container exited with code 137 (Error): 
Sep 19 21:56:35.177 E ns/e2e-services-8927 pod/affinity-clusterip-pgq2q node/ci-op-jyv2v8ft-694a5-zcv8h-worker-0-6w2n6 container/affinity-clusterip container exited with code 137 (Error): 
Sep 19 21:56:35.210 E ns/e2e-volume-expand-9065-6936 pod/csi-hostpathplugin-0 node/ci-op-jyv2v8ft-694a5-zcv8h-worker-0-6w2n6 container/node-driver-registrar container exited with code 2 (Error): 
Sep 19 21:56:35.210 E ns/e2e-volume-expand-9065-6936 pod/csi-hostpathplugin-0 node/ci-op-jyv2v8ft-694a5-zcv8h-worker-0-6w2n6 container/liveness-probe container exited with code 2 (Error): 
Sep 19 21:56:53.033 E ns/e2e-security-context-test-6227 pod/busybox-readonly-true-35d0b5a3-0aa4-4492-b09b-80b4115e218e node/ci-op-jyv2v8ft-694a5-zcv8h-worker-0-xccxs container/busybox-readonly-true-35d0b5a3-0aa4-4492-b09b-80b4115e218e init container exited with code 1 (Error): 
Sep 19 21:56:53.033 E ns/e2e-security-context-test-6227 pod/busybox-readonly-true-35d0b5a3-0aa4-4492-b09b-80b4115e218e node/ci-op-jyv2v8ft-694a5-zcv8h-worker-0-xccxs reason/Failed (): 
Sep 19 21:56:53.033 E ns/e2e-security-context-test-6227 pod/busybox-readonly-true-35d0b5a3-0aa4-4492-b09b-80b4115e218e node/ci-op-jyv2v8ft-694a5-zcv8h-worker-0-xccxs container/busybox-readonly-true-35d0b5a3-0aa4-4492-b09b-80b4115e218e container exited with code 1 (Error): 
Sep 19 21:57:07.136 E ns/e2e-aggregator-4397 pod/sample-apiserver-deployment-6fb8d6c756-9vkpf node/ci-op-jyv2v8ft-694a5-zcv8h-worker-0-xccxs container/sample-apiserver container exited with code 2 (Error): 
Sep 19 21:57:28.406 E ns/e2e-csi-mock-volumes-7856-1212 pod/csi-mockplugin-0 node/ci-op-jyv2v8ft-694a5-zcv8h-worker-0-xccxs container/driver-registrar container exited with code 2 (Error): 
Sep 19 21:57:28.406 E ns/e2e-csi-mock-volumes-7856-1212 pod/csi-mockplugin-0 node/ci-op-jyv2v8ft-694a5-zcv8h-worker-0-xccxs container/csi-provisioner container exited with code 2 (Error): Lost connection to CSI driver, exiting
Sep 19 21:57:33.466 E ns/e2e-kubelet-test-3290 pod/busybox-scheduling-45822da8-e364-4f9e-81a0-921d7c5d4229 node/ci-op-jyv2v8ft-694a5-zcv8h-worker-0-xccxs container/busybox-scheduling-45822da8-e364-4f9e-81a0-921d7c5d4229 init container exited with code 137 (Error): 
Sep 19 21:57:33.466 E ns/e2e-kubelet-test-3290 pod/busybox-scheduling-45822da8-e364-4f9e-81a0-921d7c5d4229 node/ci-op-jyv2v8ft-694a5-zcv8h-worker-0-xccxs reason/Failed (): 
Sep 19 21:57:33.466 E ns/e2e-kubelet-test-3290 pod/busybox-scheduling-45822da8-e364-4f9e-81a0-921d7c5d4229 node/ci-op-jyv2v8ft-694a5-zcv8h-worker-0-xccxs container/busybox-scheduling-45822da8-e364-4f9e-81a0-921d7c5d4229 container exited with code 137 (Error): 
Sep 19 21:57:54.714 E ns/e2e-kubectl-7715 pod/update-demo-nautilus-c4ztj node/ci-op-jyv2v8ft-694a5-zcv8h-worker-0-6w2n6 container/update-demo container exited with code 2 (Error): 
Sep 19 21:57:54.809 E ns/e2e-container-runtime-5409 pod/terminate-cmd-rpac5dd3167-986f-49b5-b938-f7a861c81b60 node/ci-op-jyv2v8ft-694a5-zcv8h-worker-0-xccxs container/terminate-cmd-rpa container exited with code 1 (Error): 
Sep 19 21:57:54.876 E ns/e2e-kubectl-7715 pod/update-demo-nautilus-7vdsl node/ci-op-jyv2v8ft-694a5-zcv8h-worker-0-xccxs container/update-demo container exited with code 2 (Error): 
Sep 19 21:57:57.800 E ns/e2e-test-prometheus-krxrv pod/execpodbrdzj node/ci-op-jyv2v8ft-694a5-zcv8h-worker-0-xccxs container/agnhost-pause container exited with code 137 (Error): 
Sep 19 21:58:12.064 E ns/e2e-container-runtime-5409 pod/terminate-cmd-rpof5c0dea37-8492-4a69-ba8a-4b474899202d node/ci-op-jyv2v8ft-694a5-zcv8h-worker-0-xccxs container/terminate-cmd-rpof container exited with code 1 (Error): 
Sep 19 21:58:18.062 E ns/e2e-container-runtime-5409 pod/terminate-cmd-rpn9a8d85e7-c5dd-4ab3-b49b-4ab2a1a2246a node/ci-op-jyv2v8ft-694a5-zcv8h-worker-0-xccxs container/terminate-cmd-rpn init container exited with code 1 (Error): 
Sep 19 21:58:18.062 E ns/e2e-container-runtime-5409 pod/terminate-cmd-rpn9a8d85e7-c5dd-4ab3-b49b-4ab2a1a2246a node/ci-op-jyv2v8ft-694a5-zcv8h-worker-0-xccxs reason/Failed (): 
Sep 19 21:58:18.062 E ns/e2e-container-runtime-5409 pod/terminate-cmd-rpn9a8d85e7-c5dd-4ab3-b49b-4ab2a1a2246a node/ci-op-jyv2v8ft-694a5-zcv8h-worker-0-xccxs container/terminate-cmd-rpn container exited with code 1 (Error): 
Sep 19 21:58:18.382 E ns/openshift-infra pod/recycler-for-nfs-qgt82 node/ci-op-jyv2v8ft-694a5-zcv8h-worker-0-xccxs reason/Failed (DeadlineExceeded): Pod was active on the node longer than the specified deadline
Sep 19 21:58:38.221 E ns/e2e-volume-9121-9896 pod/csi-hostpath-attacher-0 node/ci-op-jyv2v8ft-694a5-zcv8h-worker-0-6w2n6 container/csi-attacher container exited with code 2 (Error): 
Sep 19 21:58:43.445 E ns/e2e-init-container-4091 pod/pod-init-80d5f7f8-de9e-465e-b4f5-591e36cdc7ce node/ci-op-jyv2v8ft-694a5-zcv8h-worker-0-xccxs container/init1 init container exited with code 1 (Error): 
Sep 19 21:58:45.482 E ns/e2e-init-container-4091 pod/pod-init-80d5f7f8-de9e-465e-b4f5-591e36cdc7ce node/ci-op-jyv2v8ft-694a5-zcv8h-worker-0-xccxs container/init1 init container exited with code 1 (Error): 
Sep 19 21:59:01.909 E ns/e2e-init-container-4091 pod/pod-init-80d5f7f8-de9e-465e-b4f5-591e36cdc7ce node/ci-op-jyv2v8ft-694a5-zcv8h-worker-0-xccxs container/init1 init container exited with code 1 (Error): 
Sep 19 21:59:08.113 E ns/openshift-marketplace pod/community-operators-2sgjw node/ci-op-jyv2v8ft-694a5-zcv8h-worker-0-6w2n6 container/registry-server container exited with code 1 (Error): 
Sep 19 21:59:14.396 E ns/e2e-network-policy-b-8793 pod/client-a-74tf2 node/ci-op-jyv2v8ft-694a5-zcv8h-worker-0-xccxs container/client init container exited with code 1 (Error): 
Sep 19 21:59:14.396 E ns/e2e-network-policy-b-8793 pod/client-a-74tf2 node/ci-op-jyv2v8ft-694a5-zcv8h-worker-0-xccxs reason/Failed (): 
Sep 19 21:59:14.396 E ns/e2e-network-policy-b-8793 pod/client-a-74tf2 node/ci-op-jyv2v8ft-694a5-zcv8h-worker-0-xccxs container/client container exited with code 1 (Error): 
Sep 19 21:59:29.544 E ns/e2e-init-container-4091 pod/pod-init-80d5f7f8-de9e-465e-b4f5-591e36cdc7ce node/ci-op-jyv2v8ft-694a5-zcv8h-worker-0-xccxs container/init1 init container exited with code 1 (Error): 
Sep 19 21:59:54.878 E ns/e2e-test-cli-deployment-lznl4 pod/example-2-89cxn node/ci-op-jyv2v8ft-694a5-zcv8h-worker-0-xccxs container/test container exited with code 137 (Error): 
Sep 19 22:00:25.952 E ns/e2e-test-cli-deployment-79nq7 pod/deployment-simple-1-8vpqk node/ci-op-jyv2v8ft-694a5-zcv8h-worker-0-6w2n6 container/myapp container exited with code 137 (Error): 
Sep 19 22:00:26.419 E ns/e2e-test-cli-deployment-79nq7 pod/deployment-simple-1-l6nrq node/ci-op-jyv2v8ft-694a5-zcv8h-worker-0-xccxs container/myapp container exited with code 137 (Error): 
Sep 19 22:00:48.286 E ns/e2e-test-olm-23440-r6fs6 pod/amq-streams-cluster-operator-v1.5.3-559b456f45-47zzx node/ci-op-jyv2v8ft-694a5-zcv8h-worker-0-xccxs container/cluster-operator container exited with code 1 (Error): 
Sep 19 22:00:49.307 E ns/openshift-marketplace pod/community-operators-d5f8l node/ci-op-jyv2v8ft-694a5-zcv8h-worker-0-xccxs container/registry-server container exited with code 1 (Error): 
Sep 19 22:01:04.360 E ns/e2e-test-olm-23440-r6fs6 pod/amq-streams-cluster-operator-v1.5.3-559b456f45-47zzx node/ci-op-jyv2v8ft-694a5-zcv8h-worker-0-xccxs container/cluster-operator container exited with code 1 (Error): 
Sep 19 22:01:34.543 E ns/e2e-test-olm-23440-r6fs6 pod/amq-streams-cluster-operator-v1.5.3-559b456f45-47zzx node/ci-op-jyv2v8ft-694a5-zcv8h-worker-0-xccxs container/cluster-operator container exited with code 1 (Error): 
Sep 19 22:02:16.737 E ns/e2e-test-olm-23440-r6fs6 pod/amq-streams-cluster-operator-v1.5.3-559b456f45-47zzx node/ci-op-jyv2v8ft-694a5-zcv8h-worker-0-xccxs container/cluster-operator container exited with code 1 (Error): 
Sep 19 22:03:09.561 E ns/e2e-provisioning-8809-7771 pod/csi-hostpath-attacher-0 node/ci-op-jyv2v8ft-694a5-zcv8h-worker-0-6w2n6 container/csi-attacher container exited with code 2 (Error): 
Sep 19 22:03:39.375 E ns/e2e-test-olm-23440-r6fs6 pod/amq-streams-cluster-operator-v1.5.3-559b456f45-47zzx node/ci-op-jyv2v8ft-694a5-zcv8h-worker-0-xccxs container/cluster-operator container exited with code 1 (Error): 
Sep 19 22:04:11.620 E ns/e2e-provisioning-1903-9115 pod/csi-hostpath-provisioner-0 node/ci-op-jyv2v8ft-694a5-zcv8h-worker-0-xccxs container/csi-provisioner container exited with code 2 (Error): 
Sep 19 22:04:11.676 E ns/e2e-provisioning-1903-9115 pod/csi-hostpathplugin-0 node/ci-op-jyv2v8ft-694a5-zcv8h-worker-0-xccxs container/node-driver-registrar container exited with code 2 (Error): 
Sep 19 22:04:11.676 E ns/e2e-provisioning-1903-9115 pod/csi-hostpathplugin-0 node/ci-op-jyv2v8ft-694a5-zcv8h-worker-0-xccxs container/liveness-probe container exited with code 2 (Error): 
Sep 19 22:04:19.842 E ns/openshift-marketplace pod/community-operators-2sgjw node/ci-op-jyv2v8ft-694a5-zcv8h-worker-0-6w2n6 container/registry-server container exited with code 1 (Error): 
Sep 19 22:05:56.028 E ns/e2e-test-prometheus-4rgzj pod/execpod7sxht node/ci-op-jyv2v8ft-694a5-zcv8h-worker-0-xccxs container/agnhost-pause container exited with code 137 (Error):