ResultFAILURE
Tests 0 failed / 0 succeeded
Started2020-06-05 17:49
Elapsed37s

No Test Failures!


Error lines from build-log.txt

... skipping 7 lines ...
########## STARTING STAGE: INSTALL THE ORIGIN-CI-TOOL ##########
... skipping 25 lines ...
########## STARTING STAGE: PROVISION CLOUD RESOURCES ##########
... skipping 299 lines ...
 [WARNING]: Consider using get_url or uri module rather than running curl
... skipping 728 lines ...
########## STARTING STAGE: FORWARD GCS CREDENTIALS TO REMOTE HOST ##########
... skipping 16 lines ...
########## STARTING STAGE: FORWARD PARAMETERS TO THE REMOTE HOST ##########
... skipping 26 lines ...
########## STARTING STAGE: SYNC REPOSITORIES ##########
... skipping 101 lines ...
########## STARTING STAGE: FORWARD PARAMETERS TO THE REMOTE HOST ##########
... skipping 15 lines ...
########## STARTING STAGE: USE A RAMDISK FOR ETCD ##########
... skipping 20 lines ...
########## STARTING STAGE: TURN OFF UNNECESSARY RPM REPOS ##########
... skipping 495 lines ...
########## STARTING STAGE: ENABLE DOCKER TESTED REPO ##########
... skipping 23 lines ...
########## STARTING STAGE: BUILD AN ORIGIN RELEASE ##########
... skipping 26 lines ...
[WARNING] Retrying image build for openshift/origin-source:latest, attempt 1...
[openshift/origin-source] open /data/src/github.com/openshift/origin/images/source/Dockerfile: no such file or directory
[ERROR] hack/build-base-images.sh:56: `return "${result}"` exited with status 1.
... skipping 3 lines ...
########## FINISHED STAGE: FAILURE: BUILD AN ORIGIN RELEASE [00h 00m 04s] ##########
... skipping 3 lines ...
########## STARTING STAGE: DOWNLOAD ARTIFACTS FROM THE REMOTE HOST ##########
... skipping 38 lines ...
########## STARTING STAGE: GENERATE ARTIFACTS FROM THE REMOTE HOST ##########
... skipping 45 lines ...
########## STARTING STAGE: FETCH SYSTEMD JOURNALS FROM THE REMOTE HOST ##########
... skipping 26 lines ...
########## STARTING STAGE: ASSEMBLE GCS OUTPUT ##########
... skipping 17 lines ...