ResultFAILURE
Tests 1 failed / 2 succeeded
Started2020-03-25 14:46
Elapsed4m22s
Work namespaceci-op-5vlkniwd
Refs master:126727b0
1283:82117b73
pod69e1bcd8-6ea7-11ea-aeec-0a58ac103b3a
repocoreos/coreos-assembler
revision1

Test Failures


operator Store build results into a layer on top of src and save as bin 2m2s

go run hack/e2e.go -v -test --test_args='--ginkgo.focus=operator\sStore\sbuild\sresults\sinto\sa\slayer\son\stop\sof\ssrc\sand\ssave\sas\sbin$'
could not wait for build: the build bin failed after 2m1s with reason DockerBuildFailed: Dockerfile build strategy has failed.

make[1]: Leaving directory '/go/src/github.com/coreos/coreos-assembler/mantle'
make: *** [Makefile:60: mantle-check] Error 2
subprocess exited with status 2
subprocess exited with status 2
error: build error: error building at STEP "RUN /bin/bash ... -o errexit; umask 0002; make && make check": exit status 2
				from junit_operator.xml

Filter through log files


Show 2 Passed Tests

Error lines from build-log.txt

... skipping 328 lines ...