ResultFAILURE
Tests 1 failed / 12 succeeded
Started2020-06-19 11:19
Elapsed1h21m
Work namespaceci-op-yj52pn4r
Refs master:baf8c3a4
3530:3779510e
podc076533d-b21e-11ea-9e1a-0a580a80050b
repokubevirt/kubevirt
revision1

Test Failures


operator Run template e2e-azure-nested-virt - e2e-azure-nested-virt container test 16s

go run hack/e2e.go -v -test --test_args='--ginkgo.focus=operator\sRun\stemplate\se2e\-azure\-nested\-virt\s\-\se2e\-azure\-nested\-virt\scontainer\stest$'
up to finish...
Waiting for setup to finish...
Waiting for setup to finish...
Waiting for setup to finish...
Waiting for setup to finish...
Waiting for setup to finish...
Waiting for setup to finish...
Waiting for setup to finish...
Waiting for setup to finish...
Waiting for setup to finish...
Waiting for setup to finish...
Waiting for setup to finish...
Waiting for setup to finish...
Waiting for setup to finish...
Waiting for setup to finish...
Waiting for setup to finish...
Waiting for setup to finish...
Waiting for setup to finish...
Waiting for setup to finish...
Waiting for setup to finish...
Waiting for setup to finish...
Waiting for setup to finish...
Waiting for setup to finish...
Waiting for setup to finish...
Waiting for setup to finish...
Waiting for setup to finish...
Waiting for setup to finish...
Waiting for setup to finish...
Waiting for setup to finish...
Waiting for setup to finish...
Waiting for setup to finish...
Waiting for setup to finish...
Waiting for setup to finish...
Waiting for setup to finish...
Waiting for setup to finish...
Waiting for setup to finish...
Waiting for setup to finish...
Waiting for setup to finish...
Waiting for setup to finish...
Waiting for setup to finish...
Waiting for setup to finish...
Waiting for setup to finish...
Waiting for setup to finish...
Waiting for setup to finish...
Waiting for setup to finish...
Waiting for setup to finish...
Waiting for setup to finish...
Waiting for setup to finish...
Waiting for setup to finish...
Waiting for setup to finish...
Waiting for setup to finish...
Waiting for setup to finish...
Waiting for setup to finish...
Waiting for setup to finish...
Waiting for setup to finish...
Waiting for setup to finish...
Waiting for setup to finish...
setting up ephemeral image registry
Error from server (NotFound): error when creating "hack/ci/resources/docker-registry.yaml": namespaces "ci-op-yj52pn4r" not found
Error from server (NotFound): error when creating "hack/ci/resources/docker-registry.yaml": namespaces "ci-op-yj52pn4r" not found

				from junit_operator.xml

Filter through log files


Show 12 Passed Tests

Error lines from build-log.txt

... skipping 284 lines ...