ResultFAILURE
Tests 2 failed / 15 succeeded
Started2020-05-07 12:42
Elapsed57m3s
Work namespaceci-op-j5n49z8s
Refs master:085cea37
372:537186e1
pod2fdf82a9-9060-11ea-971c-0a58ac10323f
repoopenshift-kni/baremetal-deploy
revision1

Test Failures


Test Suite performance Cluster configuration /usr/local/bin/pre-boot-tuning.sh should exist on the nodes 0.23s

go run hack/e2e.go -v -test --test_args='--ginkgo.focus=Test\sSuite\sperformance\sCluster\sconfiguration\s\/usr\/local\/bin\/pre\-boot\-tuning\.sh\sshould\sexist\son\sthe\snodes$'
/go/src/github.com/openshift-kni/baremetal-deploy/features/functests/performance/performance.go:92
cannot find the file /usr/local/bin/pre-boot-tuning.sh
Expected
    <*exec.ExitError | 0xc000412720>: {
        ProcessState: {
            pid: 7139,
            status: 256,
            rusage: {
                Utime: {Sec: 0, Usec: 203640},
                Stime: {Sec: 0, Usec: 68849},
                Maxrss: 45960,
                Ixrss: 0,
                Idrss: 0,
                Isrss: 0,
                Minflt: 11851,
                Majflt: 0,
                Nswap: 0,
                Inblock: 0,
                Oublock: 0,
                Msgsnd: 0,
                Msgrcv: 0,
                Nsignals: 0,
                Nvcsw: 736,
                Nivcsw: 2,
            },
        },
        Stderr: nil,
    }
to be nil
/go/src/github.com/openshift-kni/baremetal-deploy/features/functests/performance/performance.go:255
				
				Click to see stdout/stderrfrom unit_report.xml

Filter through log files


operator Run template performance-e2e-aws - performance-e2e-aws container test 9m4s

go run hack/e2e.go -v -test --test_args='--ginkgo.focus=operator\sRun\stemplate\sperformance\-e2e\-aws\s\-\sperformance\-e2e\-aws\scontainer\stest$'
       Majflt: 0,
                    Nswap: 0,
                    Inblock: 0,
                    Oublock: 0,
                    Msgsnd: 0,
                    Msgrcv: 0,
                    Nsignals: 0,
                    Nvcsw: 736,
                    Nivcsw: 2,
                },
            },
            Stderr: nil,
        }
    to be nil�[0m

    /go/src/github.com/openshift-kni/baremetal-deploy/features/functests/performance/performance.go:255
�[90m------------------------------�[0m
�[1mSTEP�[0m: Getting list of nodes
�[1mSTEP�[0m: Ensuring that the "worker-rt" pool is updated
�[1mSTEP�[0m: Searching for the file /usr/local/bin/pre-boot-tuning.sh.Executing the command "ls /rootfs//usr/local/bin/pre-boot-tuning.sh" inside the pod machine-config-daemon-h59xb
�[32m•�[0m�[32m•�[0m�[32m•�[0m
�[90m------------------------------�[0m
�[32m• [SLOW TEST:14.352 seconds]�[0m
performance
�[90m/go/src/github.com/openshift-kni/baremetal-deploy/features/functests/performance/performance.go:32�[0m
  Tuned kernel parameters
  �[90m/go/src/github.com/openshift-kni/baremetal-deploy/features/functests/performance/performance.go:132�[0m
    Should contain configuration injected through the 12-tuned-worker-rt template
    �[90m/go/src/github.com/openshift-kni/baremetal-deploy/features/functests/performance/performance.go:133�[0m
�[90m------------------------------�[0m

JUnit report was created: /tmp/artifacts/unit_report.xml


�[91m�[1mSummarizing 1 Failure:�[0m

�[91m�[1m[Fail] �[0m�[90mperformance �[0m�[0mCluster configuration �[0m�[91m�[1m[It] /usr/local/bin/pre-boot-tuning.sh should exist on the nodes �[0m
�[37m/go/src/github.com/openshift-kni/baremetal-deploy/features/functests/performance/performance.go:255�[0m

�[1m�[91mRan 9 of 14 Specs in 111.257 seconds�[0m
�[1m�[91mFAIL!�[0m -- �[32m�[1m8 Passed�[0m | �[91m�[1m1 Failed�[0m | �[33m�[1m0 Pending�[0m | �[36m�[1m5 Skipped�[0m
--- FAIL: TestTest (111.26s)
FAIL

Ginkgo ran 1 suite in 2m8.717151923s
Test Suite Failed
make: *** [Makefile:11: functests] Error 1

				from junit_operator.xml

Find machine-config-daemon-h59xb mentions in log files


Show 15 Passed Tests

Show 5 Skipped Tests