ResultSUCCESS
Tests 1 failed / 139 succeeded
Started2020-06-26 14:55
Elapsed2h50m
Work namespaceci-op-wqmhr5cq
Refs master:efbd5558
158:32f5b573
pod0b75eca9-b7bd-11ea-8921-0a580a810487
repoopenshift/builder
revision1

Test Failures


openshift-tests Monitor cluster while tests execute 1h4m

go run hack/e2e.go -v -test --test_args='--ginkgo.focus=openshift\-tests\sMonitor\scluster\swhile\stests\sexecute$'
126 error level events were detected during this test run:

Jun 26 16:19:17.542 E ns/e2e-test-update-buildstatus-pbnvg pod/statusfail-genericfailure-1-build node/ip-10-0-137-182.ec2.internal container/sti-build init container exited with code 255 (Error): :name":{}},"f:scripts":{}},"f:type":{}},"f:triggeredBy":{}},"f:status":{"f:conditions":{".":{},"k:{\"type\":\"New\"}":{".":{},"f:lastTransitionTime":{},"f:lastUpdateTime":{},"f:status":{},"f:type":{}}},"f:config":{".":{},"f:kind":{},"f:name":{},"f:namespace":{}},"f:phase":{}}}}]},"spec":{"serviceAccount":"builder","source":{"type":"Git","git":{"uri":"https://github.com/sclorg/ruby-ex"}},"strategy":{"type":"Source","sourceStrategy":{"from":{"kind":"DockerImage","name":"centos/ruby-23-centos7:latest"},"pullSecret":{"name":"builder-dockercfg-l8946"},"env":[{"name":"http_proxy","value":"http://%"},{"name":"BUILD_LOGLEVEL","value":"5"}],"scripts":"http://example.org/scripts"}},"output":{},"resources":{},"postCommit":{},"nodeSelector":null,"triggeredBy":[{"message":"Manually triggered"}]},"status":{"phase":"New","config":{"kind":"BuildConfig","namespace":"e2e-test-update-buildstatus-pbnvg","name":"statusfail-genericfailure"},"output":{},"conditions":[{"type":"New","status":"True","lastUpdateTime":"2020-06-26T16:18:59Z","lastTransitionTime":"2020-06-26T16:18:59Z"}]}}\nCaching blobs under "/var/cache/blobs".\nI0626 16:19:16.356209       1 util_linux.go:57] found cgroup parent kubepods-besteffort-podce220021_4b7e_4b2f_b279_432f940815e9.slice\nI0626 16:19:16.356239       1 builder.go:344] Running build with cgroup limits: api.CGroupLimits{MemoryLimitBytes:92233720368547, CPUShares:0, CPUPeriod:0, CPUQuota:0, MemorySwap:92233720368547, Parent:"kubepods-besteffort-podce220021_4b7e_4b2f_b279_432f940815e9.slice"}\nI0626 16:19:16.356343       1 sti.go:156] Found git source info: git.SourceInfo{Ref:"master", CommitID:"c00ecd7c762590f1d52c316c7d00141a745ede18", Date:"Thu Dec 13 15:35:54 2018 +0100", AuthorName:"Honza Horak", AuthorEmail:"hhorak@redhat.com", CommitterName:"GitHub", CommitterEmail:"noreply@github.com", Message:"Merge pull request #25 from pvalena/master", Location:"https://github.com/sclorg/ruby-ex", ContextDir:""}\nF0626 16:19:16.385678       1 helpers.go:115] error: build error: parse http://%: invalid URL escape "%"\n
Jun 26 16:19:17.542 E ns/e2e-test-update-buildstatus-pbnvg pod/statusfail-genericfailure-1-build node/ip-10-0-137-182.ec2.internal reason/Failed (): 
Jun 26 16:19:17.542 E ns/e2e-test-update-buildstatus-pbnvg pod/statusfail-genericfailure-1-build node/ip-10-0-137-182.ec2.internal container/sti-build container exited with code 255 (Error): :name":{}},"f:scripts":{}},"f:type":{}},"f:triggeredBy":{}},"f:status":{"f:conditions":{".":{},"k:{\"type\":\"New\"}":{".":{},"f:lastTransitionTime":{},"f:lastUpdateTime":{},"f:status":{},"f:type":{}}},"f:config":{".":{},"f:kind":{},"f:name":{},"f:namespace":{}},"f:phase":{}}}}]},"spec":{"serviceAccount":"builder","source":{"type":"Git","git":{"uri":"https://github.com/sclorg/ruby-ex"}},"strategy":{"type":"Source","sourceStrategy":{"from":{"kind":"DockerImage","name":"centos/ruby-23-centos7:latest"},"pullSecret":{"name":"builder-dockercfg-l8946"},"env":[{"name":"http_proxy","value":"http://%"},{"name":"BUILD_LOGLEVEL","value":"5"}],"scripts":"http://example.org/scripts"}},"output":{},"resources":{},"postCommit":{},"nodeSelector":null,"triggeredBy":[{"message":"Manually triggered"}]},"status":{"phase":"New","config":{"kind":"BuildConfig","namespace":"e2e-test-update-buildstatus-pbnvg","name":"statusfail-genericfailure"},"output":{},"conditions":[{"type":"New","status":"True","lastUpdateTime":"2020-06-26T16:18:59Z","lastTransitionTime":"2020-06-26T16:18:59Z"}]}}\nCaching blobs under "/var/cache/blobs".\nI0626 16:19:16.356209       1 util_linux.go:57] found cgroup parent kubepods-besteffort-podce220021_4b7e_4b2f_b279_432f940815e9.slice\nI0626 16:19:16.356239       1 builder.go:344] Running build with cgroup limits: api.CGroupLimits{MemoryLimitBytes:92233720368547, CPUShares:0, CPUPeriod:0, CPUQuota:0, MemorySwap:92233720368547, Parent:"kubepods-besteffort-podce220021_4b7e_4b2f_b279_432f940815e9.slice"}\nI0626 16:19:16.356343       1 sti.go:156] Found git source info: git.SourceInfo{Ref:"master", CommitID:"c00ecd7c762590f1d52c316c7d00141a745ede18", Date:"Thu Dec 13 15:35:54 2018 +0100", AuthorName:"Honza Horak", AuthorEmail:"hhorak@redhat.com", CommitterName:"GitHub", CommitterEmail:"noreply@github.com", Message:"Merge pull request #25 from pvalena/master", Location:"https://github.com/sclorg/ruby-ex", ContextDir:""}\nF0626 16:19:16.385678       1 helpers.go:115] error: build error: parse http://%: invalid URL escape "%"\n
Jun 26 16:23:02.953 E ns/e2e-test-imagechangetriggers-4bbcz pod/bc-source-1-build node/ip-10-0-137-182.ec2.internal container/git-clone init container exited with code 137 (ContainerStatusUnknown): The container could not be located when the pod was terminated
Jun 26 16:25:02.859 E ns/e2e-test-cli-test-hooks-wsv9b pod/mydockertest-4-build node/ip-10-0-137-182.ec2.internal container/docker-build init container exited with code 255 (Error): fig file /var/run/secrets/openshift.io/pull/.dockercfg\nBuilding...\nI0626 16:24:59.090833       1 daemonless.go:532] Setting authentication for registry "image-registry.openshift-image-registry.svc:5000" at "image-registry.openshift-image-registry.svc:5000".\nI0626 16:24:59.091397       1 daemonless.go:532] Setting authentication for registry "172.30.169.4:5000" at "172.30.169.4:5000".\nI0626 16:24:59.097256       1 daemonless.go:532] Setting authentication for registry "image-registry.openshift-image-registry.svc.cluster.local:5000" at "image-registry.openshift-image-registry.svc.cluster.local:5000".\nSTEP 1: FROM busybox:latest AS appimage7034e0d74cec47fab7296f08418191ec\nSTEP 2: ENV "BUILD_LOGLEVEL"="5"\ntime="2020-06-26T16:24:59Z" level=info msg="Image operating system mismatch: image uses OS \"\"+architecture \"\", expecting one of \"linux+amd64\""\n--> 4fc6040e1cd\nSTEP 3: ENV "OPENSHIFT_BUILD_NAME"="mydockertest-4" "OPENSHIFT_BUILD_NAMESPACE"="e2e-test-cli-test-hooks-wsv9b"\ntime="2020-06-26T16:24:59Z" level=info msg="Image operating system mismatch: image uses OS \"\"+architecture \"\", expecting one of \"linux+amd64\""\n--> 591f5dbcff1\nSTEP 4: LABEL "io.openshift.build.name"="mydockertest-4" "io.openshift.build.namespace"="e2e-test-cli-test-hooks-wsv9b"\ntime="2020-06-26T16:24:59Z" level=info msg="Image operating system mismatch: image uses OS \"\"+architecture \"\", expecting one of \"linux+amd64\""\n--> 953db7e6282\nSTEP 5: FROM 953db7e6282ce47309ab0f169b42d8f46e25792f1663031b7771cd9b10349d0b\nSTEP 6: ENV "BUILD_LOGLEVEL"="5"\ntime="2020-06-26T16:24:59Z" level=info msg="Image operating system mismatch: image uses OS \"\"+architecture \"\", expecting one of \"linux+amd64\""\n--> ea32ad9fc71\nSTEP 7: RUN /bin/sh -ic 'echo about to fail && false'\nabout to fail\n/bin/sh: can't access tty; job control turned off\nsubprocess exited with status 1\nsubprocess exited with status 1\nF0626 16:25:01.854802       1 helpers.go:115] error: build error: error building at STEP "RUN /bin/sh -ic 'echo about to fail && false'": exit status 1\n
Jun 26 16:25:02.859 E ns/e2e-test-cli-test-hooks-wsv9b pod/mydockertest-4-build node/ip-10-0-137-182.ec2.internal reason/Failed (): 
Jun 26 16:25:02.859 E ns/e2e-test-cli-test-hooks-wsv9b pod/mydockertest-4-build node/ip-10-0-137-182.ec2.internal container/docker-build container exited with code 255 (Error): fig file /var/run/secrets/openshift.io/pull/.dockercfg\nBuilding...\nI0626 16:24:59.090833       1 daemonless.go:532] Setting authentication for registry "image-registry.openshift-image-registry.svc:5000" at "image-registry.openshift-image-registry.svc:5000".\nI0626 16:24:59.091397       1 daemonless.go:532] Setting authentication for registry "172.30.169.4:5000" at "172.30.169.4:5000".\nI0626 16:24:59.097256       1 daemonless.go:532] Setting authentication for registry "image-registry.openshift-image-registry.svc.cluster.local:5000" at "image-registry.openshift-image-registry.svc.cluster.local:5000".\nSTEP 1: FROM busybox:latest AS appimage7034e0d74cec47fab7296f08418191ec\nSTEP 2: ENV "BUILD_LOGLEVEL"="5"\ntime="2020-06-26T16:24:59Z" level=info msg="Image operating system mismatch: image uses OS \"\"+architecture \"\", expecting one of \"linux+amd64\""\n--> 4fc6040e1cd\nSTEP 3: ENV "OPENSHIFT_BUILD_NAME"="mydockertest-4" "OPENSHIFT_BUILD_NAMESPACE"="e2e-test-cli-test-hooks-wsv9b"\ntime="2020-06-26T16:24:59Z" level=info msg="Image operating system mismatch: image uses OS \"\"+architecture \"\", expecting one of \"linux+amd64\""\n--> 591f5dbcff1\nSTEP 4: LABEL "io.openshift.build.name"="mydockertest-4" "io.openshift.build.namespace"="e2e-test-cli-test-hooks-wsv9b"\ntime="2020-06-26T16:24:59Z" level=info msg="Image operating system mismatch: image uses OS \"\"+architecture \"\", expecting one of \"linux+amd64\""\n--> 953db7e6282\nSTEP 5: FROM 953db7e6282ce47309ab0f169b42d8f46e25792f1663031b7771cd9b10349d0b\nSTEP 6: ENV "BUILD_LOGLEVEL"="5"\ntime="2020-06-26T16:24:59Z" level=info msg="Image operating system mismatch: image uses OS \"\"+architecture \"\", expecting one of \"linux+amd64\""\n--> ea32ad9fc71\nSTEP 7: RUN /bin/sh -ic 'echo about to fail && false'\nabout to fail\n/bin/sh: can't access tty; job control turned off\nsubprocess exited with status 1\nsubprocess exited with status 1\nF0626 16:25:01.854802       1 helpers.go:115] error: build error: error building at STEP "RUN /bin/sh -ic 'echo about to fail && false'": exit status 1\n
Jun 26 16:25:12.660 E ns/e2e-test-cli-test-hooks-wsv9b pod/mydockertest-5-build node/ip-10-0-213-89.ec2.internal container/docker-build init container exited with code 255 (Error): nfiguration in '/var/run/secrets/openshift.io/pull/.dockercfg'\nUsing Docker config file /var/run/secrets/openshift.io/pull/.dockercfg\nBuilding...\nI0626 16:25:10.528433       1 daemonless.go:532] Setting authentication for registry "image-registry.openshift-image-registry.svc.cluster.local:5000" at "image-registry.openshift-image-registry.svc.cluster.local:5000".\nI0626 16:25:10.528710       1 daemonless.go:532] Setting authentication for registry "image-registry.openshift-image-registry.svc:5000" at "image-registry.openshift-image-registry.svc:5000".\nI0626 16:25:10.530392       1 daemonless.go:532] Setting authentication for registry "172.30.169.4:5000" at "172.30.169.4:5000".\nSTEP 1: FROM busybox:latest AS appimageee436dd8ec714117a856c067db7d9d04\nSTEP 2: ENV "BUILD_LOGLEVEL"="5"\ntime="2020-06-26T16:25:10Z" level=info msg="Image operating system mismatch: image uses OS \"\"+architecture \"\", expecting one of \"linux+amd64\""\n--> 36d82ffcb33\nSTEP 3: ENV "OPENSHIFT_BUILD_NAME"="mydockertest-5" "OPENSHIFT_BUILD_NAMESPACE"="e2e-test-cli-test-hooks-wsv9b"\ntime="2020-06-26T16:25:10Z" level=info msg="Image operating system mismatch: image uses OS \"\"+architecture \"\", expecting one of \"linux+amd64\""\n--> 15453b8bbc4\nSTEP 4: LABEL "io.openshift.build.name"="mydockertest-5" "io.openshift.build.namespace"="e2e-test-cli-test-hooks-wsv9b"\ntime="2020-06-26T16:25:10Z" level=info msg="Image operating system mismatch: image uses OS \"\"+architecture \"\", expecting one of \"linux+amd64\""\n--> 898a9602caf\nSTEP 5: FROM 898a9602caf6216c1d4e375594573635ef39346b3efda6e8e69c02d04a20f8ce\nSTEP 6: ENV "BUILD_LOGLEVEL"="5"\ntime="2020-06-26T16:25:10Z" level=info msg="Image operating system mismatch: image uses OS \"\"+architecture \"\", expecting one of \"linux+amd64\""\n--> 9c8eb71b31f\nSTEP 7: RUN sh -c echo about to fail && false\n\nsubprocess exited with status 1\nsubprocess exited with status 1\nF0626 16:25:11.971013       1 helpers.go:115] error: build error: error building at STEP "RUN sh -c echo about to fail && false": exit status 1\n
Jun 26 16:25:12.660 E ns/e2e-test-cli-test-hooks-wsv9b pod/mydockertest-5-build node/ip-10-0-213-89.ec2.internal reason/Failed (): 
Jun 26 16:25:12.660 E ns/e2e-test-cli-test-hooks-wsv9b pod/mydockertest-5-build node/ip-10-0-213-89.ec2.internal container/docker-build container exited with code 255 (Error): nfiguration in '/var/run/secrets/openshift.io/pull/.dockercfg'\nUsing Docker config file /var/run/secrets/openshift.io/pull/.dockercfg\nBuilding...\nI0626 16:25:10.528433       1 daemonless.go:532] Setting authentication for registry "image-registry.openshift-image-registry.svc.cluster.local:5000" at "image-registry.openshift-image-registry.svc.cluster.local:5000".\nI0626 16:25:10.528710       1 daemonless.go:532] Setting authentication for registry "image-registry.openshift-image-registry.svc:5000" at "image-registry.openshift-image-registry.svc:5000".\nI0626 16:25:10.530392       1 daemonless.go:532] Setting authentication for registry "172.30.169.4:5000" at "172.30.169.4:5000".\nSTEP 1: FROM busybox:latest AS appimageee436dd8ec714117a856c067db7d9d04\nSTEP 2: ENV "BUILD_LOGLEVEL"="5"\ntime="2020-06-26T16:25:10Z" level=info msg="Image operating system mismatch: image uses OS \"\"+architecture \"\", expecting one of \"linux+amd64\""\n--> 36d82ffcb33\nSTEP 3: ENV "OPENSHIFT_BUILD_NAME"="mydockertest-5" "OPENSHIFT_BUILD_NAMESPACE"="e2e-test-cli-test-hooks-wsv9b"\ntime="2020-06-26T16:25:10Z" level=info msg="Image operating system mismatch: image uses OS \"\"+architecture \"\", expecting one of \"linux+amd64\""\n--> 15453b8bbc4\nSTEP 4: LABEL "io.openshift.build.name"="mydockertest-5" "io.openshift.build.namespace"="e2e-test-cli-test-hooks-wsv9b"\ntime="2020-06-26T16:25:10Z" level=info msg="Image operating system mismatch: image uses OS \"\"+architecture \"\", expecting one of \"linux+amd64\""\n--> 898a9602caf\nSTEP 5: FROM 898a9602caf6216c1d4e375594573635ef39346b3efda6e8e69c02d04a20f8ce\nSTEP 6: ENV "BUILD_LOGLEVEL"="5"\ntime="2020-06-26T16:25:10Z" level=info msg="Image operating system mismatch: image uses OS \"\"+architecture \"\", expecting one of \"linux+amd64\""\n--> 9c8eb71b31f\nSTEP 7: RUN sh -c echo about to fail && false\n\nsubprocess exited with status 1\nsubprocess exited with status 1\nF0626 16:25:11.971013       1 helpers.go:115] error: build error: error building at STEP "RUN sh -c echo about to fail && false": exit status 1\n
Jun 26 16:25:48.155 E ns/e2e-test-cli-test-hooks-wsv9b pod/mydockertest-6-build node/ip-10-0-213-89.ec2.internal container/docker-build init container exited with code 255 (Error): nfiguration in '/var/run/secrets/openshift.io/pull/.dockercfg'\nUsing Docker config file /var/run/secrets/openshift.io/pull/.dockercfg\nBuilding...\nI0626 16:25:29.047904       1 daemonless.go:532] Setting authentication for registry "image-registry.openshift-image-registry.svc.cluster.local:5000" at "image-registry.openshift-image-registry.svc.cluster.local:5000".\nI0626 16:25:29.051415       1 daemonless.go:532] Setting authentication for registry "image-registry.openshift-image-registry.svc:5000" at "image-registry.openshift-image-registry.svc:5000".\nI0626 16:25:29.061162       1 daemonless.go:532] Setting authentication for registry "172.30.169.4:5000" at "172.30.169.4:5000".\nSTEP 1: FROM busybox:latest AS appimageee8205568e684f3bbd16e97d907c6ce7\nSTEP 2: ENV "BUILD_LOGLEVEL"="5"\ntime="2020-06-26T16:25:29Z" level=info msg="Image operating system mismatch: image uses OS \"\"+architecture \"\", expecting one of \"linux+amd64\""\n--> 465dd5468a4\nSTEP 3: ENV "OPENSHIFT_BUILD_NAME"="mydockertest-6" "OPENSHIFT_BUILD_NAMESPACE"="e2e-test-cli-test-hooks-wsv9b"\ntime="2020-06-26T16:25:29Z" level=info msg="Image operating system mismatch: image uses OS \"\"+architecture \"\", expecting one of \"linux+amd64\""\n--> d2cf33aa821\nSTEP 4: LABEL "io.openshift.build.name"="mydockertest-6" "io.openshift.build.namespace"="e2e-test-cli-test-hooks-wsv9b"\ntime="2020-06-26T16:25:29Z" level=info msg="Image operating system mismatch: image uses OS \"\"+architecture \"\", expecting one of \"linux+amd64\""\n--> b93f4c0556f\nSTEP 5: FROM b93f4c0556fc5fde4f82f9981c64195f6da792ecc31ed8923924349a2212c3ff\nSTEP 6: ENV "BUILD_LOGLEVEL"="5"\ntime="2020-06-26T16:25:29Z" level=info msg="Image operating system mismatch: image uses OS \"\"+architecture \"\", expecting one of \"linux+amd64\""\n--> 18ceba7f96c\nSTEP 7: RUN sh -c echo about to fail && false\n\nsubprocess exited with status 1\nsubprocess exited with status 1\nF0626 16:25:47.877092       1 helpers.go:115] error: build error: error building at STEP "RUN sh -c echo about to fail && false": exit status 1\n
Jun 26 16:25:48.155 E ns/e2e-test-cli-test-hooks-wsv9b pod/mydockertest-6-build node/ip-10-0-213-89.ec2.internal reason/Failed (): 
Jun 26 16:25:48.155 E ns/e2e-test-cli-test-hooks-wsv9b pod/mydockertest-6-build node/ip-10-0-213-89.ec2.internal container/docker-build container exited with code 255 (Error): nfiguration in '/var/run/secrets/openshift.io/pull/.dockercfg'\nUsing Docker config file /var/run/secrets/openshift.io/pull/.dockercfg\nBuilding...\nI0626 16:25:29.047904       1 daemonless.go:532] Setting authentication for registry "image-registry.openshift-image-registry.svc.cluster.local:5000" at "image-registry.openshift-image-registry.svc.cluster.local:5000".\nI0626 16:25:29.051415       1 daemonless.go:532] Setting authentication for registry "image-registry.openshift-image-registry.svc:5000" at "image-registry.openshift-image-registry.svc:5000".\nI0626 16:25:29.061162       1 daemonless.go:532] Setting authentication for registry "172.30.169.4:5000" at "172.30.169.4:5000".\nSTEP 1: FROM busybox:latest AS appimageee8205568e684f3bbd16e97d907c6ce7\nSTEP 2: ENV "BUILD_LOGLEVEL"="5"\ntime="2020-06-26T16:25:29Z" level=info msg="Image operating system mismatch: image uses OS \"\"+architecture \"\", expecting one of \"linux+amd64\""\n--> 465dd5468a4\nSTEP 3: ENV "OPENSHIFT_BUILD_NAME"="mydockertest-6" "OPENSHIFT_BUILD_NAMESPACE"="e2e-test-cli-test-hooks-wsv9b"\ntime="2020-06-26T16:25:29Z" level=info msg="Image operating system mismatch: image uses OS \"\"+architecture \"\", expecting one of \"linux+amd64\""\n--> d2cf33aa821\nSTEP 4: LABEL "io.openshift.build.name"="mydockertest-6" "io.openshift.build.namespace"="e2e-test-cli-test-hooks-wsv9b"\ntime="2020-06-26T16:25:29Z" level=info msg="Image operating system mismatch: image uses OS \"\"+architecture \"\", expecting one of \"linux+amd64\""\n--> b93f4c0556f\nSTEP 5: FROM b93f4c0556fc5fde4f82f9981c64195f6da792ecc31ed8923924349a2212c3ff\nSTEP 6: ENV "BUILD_LOGLEVEL"="5"\ntime="2020-06-26T16:25:29Z" level=info msg="Image operating system mismatch: image uses OS \"\"+architecture \"\", expecting one of \"linux+amd64\""\n--> 18ceba7f96c\nSTEP 7: RUN sh -c echo about to fail && false\n\nsubprocess exited with status 1\nsubprocess exited with status 1\nF0626 16:25:47.877092       1 helpers.go:115] error: build error: error building at STEP "RUN sh -c echo about to fail && false": exit status 1\n
Jun 26 16:26:33.645 E ns/e2e-test-build-proxy-bsrn6 pod/sample-build-1-build node/ip-10-0-213-89.ec2.internal container/git-clone container exited with code 255 (Error): pe\":\"New\"}":{".":{},"f:lastTransitionTime":{},"f:lastUpdateTime":{},"f:status":{},"f:type":{}}},"f:config":{".":{},"f:kind":{},"f:name":{},"f:namespace":{}},"f:phase":{}}}}]},"spec":{"serviceAccount":"builder","source":{"type":"Git","git":{"uri":"https://github.com/openshift/ruby-hello-world.git","httpProxy":"127.0.0.1:3128","httpsProxy":"127.0.0.1:3128"}},"strategy":{"type":"Source","sourceStrategy":{"from":{"kind":"DockerImage","name":"docker.io/openshift/test-build-simples2i:latest"},"pullSecret":{"name":"builder-dockercfg-nmfwh"},"env":[{"name":"HTTPS_PROXY","value":"127.0.0.1:3128"},{"name":"HTTP_PROXY","value":"127.0.0.1:3128"},{"name":"BUILD_LOGLEVEL","value":"5"}]}},"output":{},"resources":{},"postCommit":{},"nodeSelector":null,"triggeredBy":[{"message":"Manually triggered"}]},"status":{"phase":"New","config":{"kind":"BuildConfig","namespace":"e2e-test-build-proxy-bsrn6","name":"sample-build"},"output":{},"conditions":[{"type":"New","status":"True","lastUpdateTime":"2020-06-26T16:26:04Z","lastTransitionTime":"2020-06-26T16:26:04Z"}]}}\nCloning "https://github.com/openshift/ruby-hello-world.git" ...\nI0626 16:26:19.517994       1 source.go:237] git ls-remote --heads https://github.com/openshift/ruby-hello-world.git\nI0626 16:26:19.518013       1 repository.go:424] Executing git ls-remote --heads https://github.com/openshift/ruby-hello-world.git\nI0626 16:26:19.549042       1 repository.go:492] Error executing command: exit status 128\nI0626 16:26:19.549131       1 source.go:237] fatal: unable to access 'https://github.com/openshift/ruby-hello-world.git/': Failed connect to 127.0.0.1:3128; Connection refused\nerror: Unable to update build status: Get https://172.30.0.1:443/apis/build.openshift.io/v1/namespaces/e2e-test-build-proxy-bsrn6/builds/sample-build-1: proxyconnect tcp: dial tcp 127.0.0.1:3128: connect: connection refused\nF0626 16:26:33.273425       1 helpers.go:115] error: fatal: unable to access 'https://github.com/openshift/ruby-hello-world.git/': Failed connect to 127.0.0.1:3128; Connection refused\n
Jun 26 16:26:33.645 E ns/e2e-test-build-proxy-bsrn6 pod/sample-build-1-build node/ip-10-0-213-89.ec2.internal reason/Failed (): 
Jun 26 16:26:33.645 E ns/e2e-test-build-proxy-bsrn6 pod/sample-build-1-build node/ip-10-0-213-89.ec2.internal container/git-clone init container exited with code 255 (Error): pe\":\"New\"}":{".":{},"f:lastTransitionTime":{},"f:lastUpdateTime":{},"f:status":{},"f:type":{}}},"f:config":{".":{},"f:kind":{},"f:name":{},"f:namespace":{}},"f:phase":{}}}}]},"spec":{"serviceAccount":"builder","source":{"type":"Git","git":{"uri":"https://github.com/openshift/ruby-hello-world.git","httpProxy":"127.0.0.1:3128","httpsProxy":"127.0.0.1:3128"}},"strategy":{"type":"Source","sourceStrategy":{"from":{"kind":"DockerImage","name":"docker.io/openshift/test-build-simples2i:latest"},"pullSecret":{"name":"builder-dockercfg-nmfwh"},"env":[{"name":"HTTPS_PROXY","value":"127.0.0.1:3128"},{"name":"HTTP_PROXY","value":"127.0.0.1:3128"},{"name":"BUILD_LOGLEVEL","value":"5"}]}},"output":{},"resources":{},"postCommit":{},"nodeSelector":null,"triggeredBy":[{"message":"Manually triggered"}]},"status":{"phase":"New","config":{"kind":"BuildConfig","namespace":"e2e-test-build-proxy-bsrn6","name":"sample-build"},"output":{},"conditions":[{"type":"New","status":"True","lastUpdateTime":"2020-06-26T16:26:04Z","lastTransitionTime":"2020-06-26T16:26:04Z"}]}}\nCloning "https://github.com/openshift/ruby-hello-world.git" ...\nI0626 16:26:19.517994       1 source.go:237] git ls-remote --heads https://github.com/openshift/ruby-hello-world.git\nI0626 16:26:19.518013       1 repository.go:424] Executing git ls-remote --heads https://github.com/openshift/ruby-hello-world.git\nI0626 16:26:19.549042       1 repository.go:492] Error executing command: exit status 128\nI0626 16:26:19.549131       1 source.go:237] fatal: unable to access 'https://github.com/openshift/ruby-hello-world.git/': Failed connect to 127.0.0.1:3128; Connection refused\nerror: Unable to update build status: Get https://172.30.0.1:443/apis/build.openshift.io/v1/namespaces/e2e-test-build-proxy-bsrn6/builds/sample-build-1: proxyconnect tcp: dial tcp 127.0.0.1:3128: connect: connection refused\nF0626 16:26:33.273425       1 helpers.go:115] error: fatal: unable to access 'https://github.com/openshift/ruby-hello-world.git/': Failed connect to 127.0.0.1:3128; Connection refused\n
Jun 26 16:27:47.335 E ns/e2e-test-update-buildstatus-m8xsb pod/statusfail-oomkilled-1-build node/ip-10-0-137-182.ec2.internal container/sti-build init container exited with code 137 (OOMKilled): mitterEmail:"noreply@github.com", Message:"Merge pull request #85 from wewang58/master", Location:"https://github.com/openshift/ruby-hello-world", ContextDir:""}\nI0626 16:27:44.522978       1 sti.go:231] Locating docker config paths for type PULL_DOCKERCFG_PATH\nI0626 16:27:44.523002       1 sti.go:231] Getting docker config in paths : [/var/run/secrets/openshift.io/pull]\nExplicitly pulling image centos/ruby-23-centos7:latest\nAsked to pull fresh copy of "centos/ruby-23-centos7:latest".\nI0626 16:27:44.523058       1 daemonless.go:120] looking for config.json at /var/run/secrets/openshift.io/pull/config.json\nI0626 16:27:44.523090       1 cfg.go:151] error reading file: open /var/run/secrets/openshift.io/pull/config.json: no such file or directory\nI0626 16:27:44.523102       1 daemonless.go:120] looking for .dockerconfigjson at /var/run/secrets/openshift.io/pull/.dockerconfigjson\nI0626 16:27:44.523123       1 cfg.go:151] error reading file: open /var/run/secrets/openshift.io/pull/.dockerconfigjson: no such file or directory\nI0626 16:27:44.523134       1 daemonless.go:120] looking for .dockercfg at /var/run/secrets/openshift.io/pull/.dockercfg\nI0626 16:27:44.523333       1 daemonless.go:120] found valid .dockercfg at /var/run/secrets/openshift.io/pull/.dockercfg\nI0626 16:27:44.531203       1 config.go:107] looking for .dockercfg at /var/run/secrets/openshift.io/pull/.dockercfg\nI0626 16:27:44.531557       1 config.go:118] found .dockercfg at /var/run/secrets/openshift.io/pull/.dockercfg\nGetting image source signatures\nCopying blob sha256:8ba884070f611d31cb2c42eddb691319dc9facf5e0ec67672fcfa135181ab3df\nCopying blob sha256:ee720ba20823ba4560916cf32bc06c5e31c230cb76f641be4a5fbfc7754d7574\nCopying blob sha256:ebf1fb961f612b70f32c7d9184c8b3e06b9f427dff8c77385a489a4f2fbfac12\nCopying blob sha256:c3dca185eb1482e83381d99881430ebc179e91f0969bc905207cd1e2312e5b57\nCopying blob sha256:858a4979076876f29cc96b6e967c10665b2a2a0af105e26e56f246d7ee9eb0bf\nCopying blob sha256:497ef6ea0fac8097af3363a9b9032f0948098a9fa2b9002eb51ac65f2ed29cf6\n
Jun 26 16:27:47.335 E ns/e2e-test-update-buildstatus-m8xsb pod/statusfail-oomkilled-1-build node/ip-10-0-137-182.ec2.internal reason/Failed (): 
Jun 26 16:27:47.335 E ns/e2e-test-update-buildstatus-m8xsb pod/statusfail-oomkilled-1-build node/ip-10-0-137-182.ec2.internal container/sti-build container exited with code 137 (OOMKilled): mitterEmail:"noreply@github.com", Message:"Merge pull request #85 from wewang58/master", Location:"https://github.com/openshift/ruby-hello-world", ContextDir:""}\nI0626 16:27:44.522978       1 sti.go:231] Locating docker config paths for type PULL_DOCKERCFG_PATH\nI0626 16:27:44.523002       1 sti.go:231] Getting docker config in paths : [/var/run/secrets/openshift.io/pull]\nExplicitly pulling image centos/ruby-23-centos7:latest\nAsked to pull fresh copy of "centos/ruby-23-centos7:latest".\nI0626 16:27:44.523058       1 daemonless.go:120] looking for config.json at /var/run/secrets/openshift.io/pull/config.json\nI0626 16:27:44.523090       1 cfg.go:151] error reading file: open /var/run/secrets/openshift.io/pull/config.json: no such file or directory\nI0626 16:27:44.523102       1 daemonless.go:120] looking for .dockerconfigjson at /var/run/secrets/openshift.io/pull/.dockerconfigjson\nI0626 16:27:44.523123       1 cfg.go:151] error reading file: open /var/run/secrets/openshift.io/pull/.dockerconfigjson: no such file or directory\nI0626 16:27:44.523134       1 daemonless.go:120] looking for .dockercfg at /var/run/secrets/openshift.io/pull/.dockercfg\nI0626 16:27:44.523333       1 daemonless.go:120] found valid .dockercfg at /var/run/secrets/openshift.io/pull/.dockercfg\nI0626 16:27:44.531203       1 config.go:107] looking for .dockercfg at /var/run/secrets/openshift.io/pull/.dockercfg\nI0626 16:27:44.531557       1 config.go:118] found .dockercfg at /var/run/secrets/openshift.io/pull/.dockercfg\nGetting image source signatures\nCopying blob sha256:8ba884070f611d31cb2c42eddb691319dc9facf5e0ec67672fcfa135181ab3df\nCopying blob sha256:ee720ba20823ba4560916cf32bc06c5e31c230cb76f641be4a5fbfc7754d7574\nCopying blob sha256:ebf1fb961f612b70f32c7d9184c8b3e06b9f427dff8c77385a489a4f2fbfac12\nCopying blob sha256:c3dca185eb1482e83381d99881430ebc179e91f0969bc905207cd1e2312e5b57\nCopying blob sha256:858a4979076876f29cc96b6e967c10665b2a2a0af105e26e56f246d7ee9eb0bf\nCopying blob sha256:497ef6ea0fac8097af3363a9b9032f0948098a9fa2b9002eb51ac65f2ed29cf6\n
Jun 26 16:28:30.614 E ns/e2e-test-build-pruning-97mgj pod/myphp-1-build node/ip-10-0-213-89.ec2.internal container/git-clone container exited with code 1 (Error): Cloning "https://github.com/openshift/non-working-example.git" ...\nerror: failed to fetch requested repository "https://github.com/openshift/non-working-example.git" with provided credentials\n
Jun 26 16:28:30.614 E ns/e2e-test-build-pruning-97mgj pod/myphp-1-build node/ip-10-0-213-89.ec2.internal reason/Failed (): 
Jun 26 16:28:30.614 E ns/e2e-test-build-pruning-97mgj pod/myphp-1-build node/ip-10-0-213-89.ec2.internal container/git-clone init container exited with code 1 (Error): Cloning "https://github.com/openshift/non-working-example.git" ...\nerror: failed to fetch requested repository "https://github.com/openshift/non-working-example.git" with provided credentials\n
Jun 26 16:28:36.677 E ns/e2e-test-build-pruning-97mgj pod/myphp-2-build node/ip-10-0-213-89.ec2.internal container/git-clone container exited with code 1 (Error): Cloning "https://github.com/openshift/non-working-example.git" ...\nerror: failed to fetch requested repository "https://github.com/openshift/non-working-example.git" with provided credentials\n
Jun 26 16:28:36.677 E ns/e2e-test-build-pruning-97mgj pod/myphp-2-build node/ip-10-0-213-89.ec2.internal reason/Failed (): 
Jun 26 16:28:36.677 E ns/e2e-test-build-pruning-97mgj pod/myphp-2-build node/ip-10-0-213-89.ec2.internal container/git-clone init container exited with code 1 (Error): Cloning "https://github.com/openshift/non-working-example.git" ...\nerror: failed to fetch requested repository "https://github.com/openshift/non-working-example.git" with provided credentials\n
Jun 26 16:28:42.591 E ns/e2e-test-build-pruning-97mgj pod/myphp-3-build node/ip-10-0-161-222.ec2.internal container/git-clone container exited with code 1 (Error): Cloning "https://github.com/openshift/non-working-example.git" ...\nerror: failed to fetch requested repository "https://github.com/openshift/non-working-example.git" with provided credentials\n
Jun 26 16:28:42.591 E ns/e2e-test-build-pruning-97mgj pod/myphp-3-build node/ip-10-0-161-222.ec2.internal reason/Failed (): 
Jun 26 16:28:42.591 E ns/e2e-test-build-pruning-97mgj pod/myphp-3-build node/ip-10-0-161-222.ec2.internal container/git-clone init container exited with code 1 (Error): Cloning "https://github.com/openshift/non-working-example.git" ...\nerror: failed to fetch requested repository "https://github.com/openshift/non-working-example.git" with provided credentials\n
Jun 26 16:28:49.743 E ns/e2e-test-build-pruning-97mgj pod/myphp-4-build node/ip-10-0-213-89.ec2.internal container/git-clone container exited with code 1 (Error): Cloning "https://github.com/openshift/non-working-example.git" ...\nerror: failed to fetch requested repository "https://github.com/openshift/non-working-example.git" with provided credentials\n
Jun 26 16:28:49.743 E ns/e2e-test-build-pruning-97mgj pod/myphp-4-build node/ip-10-0-213-89.ec2.internal reason/Failed (): 
Jun 26 16:28:49.743 E ns/e2e-test-build-pruning-97mgj pod/myphp-4-build node/ip-10-0-213-89.ec2.internal container/git-clone init container exited with code 1 (Error): Cloning "https://github.com/openshift/non-working-example.git" ...\nerror: failed to fetch requested repository "https://github.com/openshift/non-working-example.git" with provided credentials\n
Jun 26 16:29:40.410 E ns/e2e-test-cli-build-run-policy-tqf4p pod/sample-serial-build-3-build node/ip-10-0-137-182.ec2.internal container/git-clone init container exited with code 137 (ContainerStatusUnknown): The container could not be located when the pod was terminated
Jun 26 16:30:36.836 E ns/e2e-test-update-buildstatus-949gh pod/statusfail-postcommithook-1-build node/ip-10-0-137-182.ec2.internal container/sti-build init container exited with code 255 (Error): d-simples2i:latest AS appimage51ce5fb566044ca2b264434a6d00d14f\nSTEP 2: LABEL "io.openshift.build.image"="docker.io/openshift/test-build-simples2i:latest"       "io.openshift.build.commit.author"="Ben Parees <bparees@users.noreply.github.com>"       "io.openshift.build.commit.date"="Wed Nov 6 09:41:20 2019 -0500"       "io.openshift.build.commit.id"="57073c041d103a412ff7d4a6e64b0ea7f77ea1b3"       "io.openshift.build.commit.ref"="master"       "io.openshift.build.commit.message"="Merge pull request #85 from wewang58/master"       "io.openshift.build.source-location"="https://github.com/openshift/ruby-hello-world.git"\nSTEP 3: ENV RACK_ENV="production"     OPENSHIFT_BUILD_NAME="statusfail-postcommithook-1"     OPENSHIFT_BUILD_NAMESPACE="e2e-test-update-buildstatus-949gh"     OPENSHIFT_BUILD_SOURCE="https://github.com/openshift/ruby-hello-world.git"     OPENSHIFT_BUILD_COMMIT="57073c041d103a412ff7d4a6e64b0ea7f77ea1b3"     BUILD_LOGLEVEL="5"\nSTEP 4: USER root\nSTEP 5: COPY upload/src /tmp/src\nSTEP 6: RUN chown -R 1001:0 /tmp/src\nSTEP 7: USER 1001\nSTEP 8: RUN /usr/libexec/s2i/assemble\nassembled!\nSTEP 9: CMD /usr/libexec/s2i/run\ntime="2020-06-26T16:30:34Z" level=info msg="Image operating system mismatch: image uses OS \"\"+architecture \"\", expecting one of \"linux+amd64\""\nGetting image source signatures\nCopying blob sha256:683f499823be212bf04cb9540407d8353803c25d0d9eb5f2fdb62786d8b95ead\nCopying blob sha256:7dd15ca0a0cc32cc3070771a31d9711cd5b8ec82be375cb07d027eb8335ec8c2\nCopying blob sha256:2b65cbf4bc25a51703a282fa2068b27a7210eb2354e4c7ad15e19a7041120534\nCopying config sha256:6bf5882edf38425c99fa3e5d621dc7fbeeba1d9d0d8dfc52c8180b4ac43df81b\nWriting manifest to image destination\nStoring signatures\n--> 6bf5882edf3\nSTEP 10: FROM 6bf5882edf38425c99fa3e5d621dc7fbeeba1d9d0d8dfc52c8180b4ac43df81b\nSTEP 11: RUN failme\n/bin/sh: failme: not found\nsubprocess exited with status 127\nsubprocess exited with status 127\nF0626 16:30:36.099957       1 helpers.go:115] error: build error: error building at STEP "RUN failme": exit status 127\n
Jun 26 16:30:36.836 E ns/e2e-test-update-buildstatus-949gh pod/statusfail-postcommithook-1-build node/ip-10-0-137-182.ec2.internal reason/Failed (): 
Jun 26 16:30:36.836 E ns/e2e-test-update-buildstatus-949gh pod/statusfail-postcommithook-1-build node/ip-10-0-137-182.ec2.internal container/sti-build container exited with code 255 (Error): d-simples2i:latest AS appimage51ce5fb566044ca2b264434a6d00d14f\nSTEP 2: LABEL "io.openshift.build.image"="docker.io/openshift/test-build-simples2i:latest"       "io.openshift.build.commit.author"="Ben Parees <bparees@users.noreply.github.com>"       "io.openshift.build.commit.date"="Wed Nov 6 09:41:20 2019 -0500"       "io.openshift.build.commit.id"="57073c041d103a412ff7d4a6e64b0ea7f77ea1b3"       "io.openshift.build.commit.ref"="master"       "io.openshift.build.commit.message"="Merge pull request #85 from wewang58/master"       "io.openshift.build.source-location"="https://github.com/openshift/ruby-hello-world.git"\nSTEP 3: ENV RACK_ENV="production"     OPENSHIFT_BUILD_NAME="statusfail-postcommithook-1"     OPENSHIFT_BUILD_NAMESPACE="e2e-test-update-buildstatus-949gh"     OPENSHIFT_BUILD_SOURCE="https://github.com/openshift/ruby-hello-world.git"     OPENSHIFT_BUILD_COMMIT="57073c041d103a412ff7d4a6e64b0ea7f77ea1b3"     BUILD_LOGLEVEL="5"\nSTEP 4: USER root\nSTEP 5: COPY upload/src /tmp/src\nSTEP 6: RUN chown -R 1001:0 /tmp/src\nSTEP 7: USER 1001\nSTEP 8: RUN /usr/libexec/s2i/assemble\nassembled!\nSTEP 9: CMD /usr/libexec/s2i/run\ntime="2020-06-26T16:30:34Z" level=info msg="Image operating system mismatch: image uses OS \"\"+architecture \"\", expecting one of \"linux+amd64\""\nGetting image source signatures\nCopying blob sha256:683f499823be212bf04cb9540407d8353803c25d0d9eb5f2fdb62786d8b95ead\nCopying blob sha256:7dd15ca0a0cc32cc3070771a31d9711cd5b8ec82be375cb07d027eb8335ec8c2\nCopying blob sha256:2b65cbf4bc25a51703a282fa2068b27a7210eb2354e4c7ad15e19a7041120534\nCopying config sha256:6bf5882edf38425c99fa3e5d621dc7fbeeba1d9d0d8dfc52c8180b4ac43df81b\nWriting manifest to image destination\nStoring signatures\n--> 6bf5882edf3\nSTEP 10: FROM 6bf5882edf38425c99fa3e5d621dc7fbeeba1d9d0d8dfc52c8180b4ac43df81b\nSTEP 11: RUN failme\n/bin/sh: failme: not found\nsubprocess exited with status 127\nsubprocess exited with status 127\nF0626 16:30:36.099957       1 helpers.go:115] error: build error: error building at STEP "RUN failme": exit status 127\n
Jun 26 16:31:56.076 E ns/e2e-test-update-buildstatus-42fgg pod/statusfail-fetchsourcesourcetoimage-1-build node/ip-10-0-137-182.ec2.internal container/git-clone container exited with code 255 (Error): enshift.io/build.start-policy":{}},"f:ownerReferences":{".":{},"k:{\"uid\":\"32e9ecb7-d67d-4b51-bad1-2bb483e88bed\"}":{".":{},"f:apiVersion":{},"f:controller":{},"f:kind":{},"f:name":{},"f:uid":{}}}},"f:spec":{"f:serviceAccount":{},"f:source":{"f:git":{".":{},"f:uri":{}},"f:type":{}},"f:strategy":{"f:sourceStrategy":{".":{},"f:env":{},"f:from":{".":{},"f:kind":{},"f:name":{}}},"f:type":{}},"f:triggeredBy":{}},"f:status":{"f:conditions":{".":{},"k:{\"type\":\"New\"}":{".":{},"f:lastTransitionTime":{},"f:lastUpdateTime":{},"f:status":{},"f:type":{}}},"f:config":{".":{},"f:kind":{},"f:name":{},"f:namespace":{}},"f:phase":{}}}}]},"spec":{"serviceAccount":"builder","source":{"type":"Git","git":{"uri":"https://failure/sourcetoimage/status"}},"strategy":{"type":"Source","sourceStrategy":{"from":{"kind":"DockerImage","name":"centos/ruby-23-centos7:latest"},"pullSecret":{"name":"builder-dockercfg-cdm2t"},"env":[{"name":"BUILD_LOGLEVEL","value":"5"}]}},"output":{},"resources":{},"postCommit":{},"nodeSelector":null,"triggeredBy":[{"message":"Manually triggered"}]},"status":{"phase":"New","config":{"kind":"BuildConfig","namespace":"e2e-test-update-buildstatus-42fgg","name":"statusfail-fetchsourcesourcetoimage"},"output":{},"conditions":[{"type":"New","status":"True","lastUpdateTime":"2020-06-26T16:31:28Z","lastTransitionTime":"2020-06-26T16:31:28Z"}]}}\nCloning "https://failure/sourcetoimage/status" ...\nI0626 16:31:55.689425       1 source.go:237] git ls-remote --heads https://failure/sourcetoimage/status\nI0626 16:31:55.689442       1 repository.go:424] Executing git ls-remote --heads https://failure/sourcetoimage/status\nI0626 16:31:55.798645       1 repository.go:492] Error executing command: exit status 128\nI0626 16:31:55.798726       1 source.go:237] fatal: unable to access 'https://failure/sourcetoimage/status/': Could not resolve host: failure; Unknown error\nF0626 16:31:55.834610       1 helpers.go:115] error: fatal: unable to access 'https://failure/sourcetoimage/status/': Could not resolve host: failure; Unknown error\n
Jun 26 16:31:56.076 E ns/e2e-test-update-buildstatus-42fgg pod/statusfail-fetchsourcesourcetoimage-1-build node/ip-10-0-137-182.ec2.internal reason/Failed (): 
Jun 26 16:31:56.076 E ns/e2e-test-update-buildstatus-42fgg pod/statusfail-fetchsourcesourcetoimage-1-build node/ip-10-0-137-182.ec2.internal container/git-clone init container exited with code 255 (Error): enshift.io/build.start-policy":{}},"f:ownerReferences":{".":{},"k:{\"uid\":\"32e9ecb7-d67d-4b51-bad1-2bb483e88bed\"}":{".":{},"f:apiVersion":{},"f:controller":{},"f:kind":{},"f:name":{},"f:uid":{}}}},"f:spec":{"f:serviceAccount":{},"f:source":{"f:git":{".":{},"f:uri":{}},"f:type":{}},"f:strategy":{"f:sourceStrategy":{".":{},"f:env":{},"f:from":{".":{},"f:kind":{},"f:name":{}}},"f:type":{}},"f:triggeredBy":{}},"f:status":{"f:conditions":{".":{},"k:{\"type\":\"New\"}":{".":{},"f:lastTransitionTime":{},"f:lastUpdateTime":{},"f:status":{},"f:type":{}}},"f:config":{".":{},"f:kind":{},"f:name":{},"f:namespace":{}},"f:phase":{}}}}]},"spec":{"serviceAccount":"builder","source":{"type":"Git","git":{"uri":"https://failure/sourcetoimage/status"}},"strategy":{"type":"Source","sourceStrategy":{"from":{"kind":"DockerImage","name":"centos/ruby-23-centos7:latest"},"pullSecret":{"name":"builder-dockercfg-cdm2t"},"env":[{"name":"BUILD_LOGLEVEL","value":"5"}]}},"output":{},"resources":{},"postCommit":{},"nodeSelector":null,"triggeredBy":[{"message":"Manually triggered"}]},"status":{"phase":"New","config":{"kind":"BuildConfig","namespace":"e2e-test-update-buildstatus-42fgg","name":"statusfail-fetchsourcesourcetoimage"},"output":{},"conditions":[{"type":"New","status":"True","lastUpdateTime":"2020-06-26T16:31:28Z","lastTransitionTime":"2020-06-26T16:31:28Z"}]}}\nCloning "https://failure/sourcetoimage/status" ...\nI0626 16:31:55.689425       1 source.go:237] git ls-remote --heads https://failure/sourcetoimage/status\nI0626 16:31:55.689442       1 repository.go:424] Executing git ls-remote --heads https://failure/sourcetoimage/status\nI0626 16:31:55.798645       1 repository.go:492] Error executing command: exit status 128\nI0626 16:31:55.798726       1 source.go:237] fatal: unable to access 'https://failure/sourcetoimage/status/': Could not resolve host: failure; Unknown error\nF0626 16:31:55.834610       1 helpers.go:115] error: fatal: unable to access 'https://failure/sourcetoimage/status/': Could not resolve host: failure; Unknown error\n
Jun 26 16:32:02.593 E ns/e2e-test-update-buildstatus-ms9mk pod/statusfail-fetchsourcedocker-1-build node/ip-10-0-213-89.ec2.internal container/git-clone container exited with code 255 (Error): g":{},"f:openshift.io/build-config.name":{},"f:openshift.io/build.start-policy":{}},"f:ownerReferences":{".":{},"k:{\"uid\":\"f7a09fae-02d1-4718-bce8-8f6bff6ca385\"}":{".":{},"f:apiVersion":{},"f:controller":{},"f:kind":{},"f:name":{},"f:uid":{}}}},"f:spec":{"f:serviceAccount":{},"f:source":{"f:git":{".":{},"f:uri":{}},"f:type":{}},"f:strategy":{"f:dockerStrategy":{".":{},"f:env":{},"f:from":{".":{},"f:kind":{},"f:name":{}}},"f:type":{}},"f:triggeredBy":{}},"f:status":{"f:conditions":{".":{},"k:{\"type\":\"New\"}":{".":{},"f:lastTransitionTime":{},"f:lastUpdateTime":{},"f:status":{},"f:type":{}}},"f:config":{".":{},"f:kind":{},"f:name":{},"f:namespace":{}},"f:phase":{}}}}]},"spec":{"serviceAccount":"builder","source":{"type":"Git","git":{"uri":"https://failure/docker/status"}},"strategy":{"type":"Docker","dockerStrategy":{"from":{"kind":"DockerImage","name":"centos/ruby-23-centos7:latest"},"pullSecret":{"name":"builder-dockercfg-qrj29"},"env":[{"name":"BUILD_LOGLEVEL","value":"5"}]}},"output":{},"resources":{},"postCommit":{},"nodeSelector":null,"triggeredBy":[{"message":"Manually triggered"}]},"status":{"phase":"New","config":{"kind":"BuildConfig","namespace":"e2e-test-update-buildstatus-ms9mk","name":"statusfail-fetchsourcedocker"},"output":{},"conditions":[{"type":"New","status":"True","lastUpdateTime":"2020-06-26T16:31:58Z","lastTransitionTime":"2020-06-26T16:31:58Z"}]}}\nCloning "https://failure/docker/status" ...\nI0626 16:32:02.140700       1 source.go:237] git ls-remote --heads https://failure/docker/status\nI0626 16:32:02.140745       1 repository.go:424] Executing git ls-remote --heads https://failure/docker/status\nI0626 16:32:02.243199       1 repository.go:492] Error executing command: exit status 128\nI0626 16:32:02.243283       1 source.go:237] fatal: unable to access 'https://failure/docker/status/': Could not resolve host: failure; Unknown error\nF0626 16:32:02.278452       1 helpers.go:115] error: fatal: unable to access 'https://failure/docker/status/': Could not resolve host: failure; Unknown error\n
Jun 26 16:32:02.593 E ns/e2e-test-update-buildstatus-ms9mk pod/statusfail-fetchsourcedocker-1-build node/ip-10-0-213-89.ec2.internal reason/Failed (): 
Jun 26 16:32:02.593 E ns/e2e-test-update-buildstatus-ms9mk pod/statusfail-fetchsourcedocker-1-build node/ip-10-0-213-89.ec2.internal container/git-clone init container exited with code 255 (Error): g":{},"f:openshift.io/build-config.name":{},"f:openshift.io/build.start-policy":{}},"f:ownerReferences":{".":{},"k:{\"uid\":\"f7a09fae-02d1-4718-bce8-8f6bff6ca385\"}":{".":{},"f:apiVersion":{},"f:controller":{},"f:kind":{},"f:name":{},"f:uid":{}}}},"f:spec":{"f:serviceAccount":{},"f:source":{"f:git":{".":{},"f:uri":{}},"f:type":{}},"f:strategy":{"f:dockerStrategy":{".":{},"f:env":{},"f:from":{".":{},"f:kind":{},"f:name":{}}},"f:type":{}},"f:triggeredBy":{}},"f:status":{"f:conditions":{".":{},"k:{\"type\":\"New\"}":{".":{},"f:lastTransitionTime":{},"f:lastUpdateTime":{},"f:status":{},"f:type":{}}},"f:config":{".":{},"f:kind":{},"f:name":{},"f:namespace":{}},"f:phase":{}}}}]},"spec":{"serviceAccount":"builder","source":{"type":"Git","git":{"uri":"https://failure/docker/status"}},"strategy":{"type":"Docker","dockerStrategy":{"from":{"kind":"DockerImage","name":"centos/ruby-23-centos7:latest"},"pullSecret":{"name":"builder-dockercfg-qrj29"},"env":[{"name":"BUILD_LOGLEVEL","value":"5"}]}},"output":{},"resources":{},"postCommit":{},"nodeSelector":null,"triggeredBy":[{"message":"Manually triggered"}]},"status":{"phase":"New","config":{"kind":"BuildConfig","namespace":"e2e-test-update-buildstatus-ms9mk","name":"statusfail-fetchsourcedocker"},"output":{},"conditions":[{"type":"New","status":"True","lastUpdateTime":"2020-06-26T16:31:58Z","lastTransitionTime":"2020-06-26T16:31:58Z"}]}}\nCloning "https://failure/docker/status" ...\nI0626 16:32:02.140700       1 source.go:237] git ls-remote --heads https://failure/docker/status\nI0626 16:32:02.140745       1 repository.go:424] Executing git ls-remote --heads https://failure/docker/status\nI0626 16:32:02.243199       1 repository.go:492] Error executing command: exit status 128\nI0626 16:32:02.243283       1 source.go:237] fatal: unable to access 'https://failure/docker/status/': Could not resolve host: failure; Unknown error\nF0626 16:32:02.278452       1 helpers.go:115] error: fatal: unable to access 'https://failure/docker/status/': Could not resolve host: failure; Unknown error\n
Jun 26 16:36:32.950 E ns/e2e-test-build-s2i-dropcaps-cw8sj pod/root-access-build-1-build node/ip-10-0-137-182.ec2.internal container/sti-build init container exited with code 1 (Error): 028cf\nCopying blob sha256:c77cd2c667dae6b0d198c11dac121b99e463042cd7d4d4de01c7e25dff5d1d0d\nCopying blob sha256:0ce57734b58e2e093bee378d47c1e9389a1d89f590e7f38cd5f2680a25a6da4e\nCopying config sha256:22db455832154891e5d61e26dadbc6fa09df409637c4678668c62f25cf4b02f6\nWriting manifest to image destination\nStoring signatures\nGenerating dockerfile with builder image image-registry.openshift-image-registry.svc:5000/e2e-test-build-s2i-dropcaps-cw8sj/rootable-ruby@sha256:16abb668af6a259ba3fc72b7e6b48e16d0c6774a7933b6d60fbb3b7e1eeff042\nSTEP 1: FROM image-registry.openshift-image-registry.svc:5000/e2e-test-build-s2i-dropcaps-cw8sj/rootable-ruby@sha256:16abb668af6a259ba3fc72b7e6b48e16d0c6774a7933b6d60fbb3b7e1eeff042\nSTEP 2: LABEL "io.openshift.build.image"="image-registry.openshift-image-registry.svc:5000/e2e-test-build-s2i-dropcaps-cw8sj/rootable-ruby@sha256:16abb668af6a259ba3fc72b7e6b48e16d0c6774a7933b6d60fbb3b7e1eeff042"       "io.openshift.build.commit.author"="Ben Parees <bparees@users.noreply.github.com>"       "io.openshift.build.commit.date"="Wed Nov 6 09:41:20 2019 -0500"       "io.openshift.build.commit.id"="57073c041d103a412ff7d4a6e64b0ea7f77ea1b3"       "io.openshift.build.commit.ref"="master"       "io.openshift.build.commit.message"="Merge pull request #85 from wewang58/master"       "io.openshift.build.source-location"="https://github.com/openshift/ruby-hello-world.git"\nSTEP 3: ENV RACK_ENV="production"     OPENSHIFT_BUILD_NAME="root-access-build-1"     OPENSHIFT_BUILD_NAMESPACE="e2e-test-build-s2i-dropcaps-cw8sj"     OPENSHIFT_BUILD_SOURCE="https://github.com/openshift/ruby-hello-world.git"     OPENSHIFT_BUILD_COMMIT="57073c041d103a412ff7d4a6e64b0ea7f77ea1b3"\nSTEP 4: USER root\nSTEP 5: COPY upload/src /tmp/src\nSTEP 6: RUN chown -R 1001:0 /tmp/src\nSTEP 7: USER 1001\nSTEP 8: RUN /usr/libexec/s2i/assemble\n/bin/sh: /usr/libexec/s2i/assemble: Permission denied\nsubprocess exited with status 126\nsubprocess exited with status 126\nerror: build error: error building at STEP "RUN /usr/libexec/s2i/assemble": exit status 126\n
Jun 26 16:36:32.950 E ns/e2e-test-build-s2i-dropcaps-cw8sj pod/root-access-build-1-build node/ip-10-0-137-182.ec2.internal reason/Failed (): 
Jun 26 16:36:32.950 E ns/e2e-test-build-s2i-dropcaps-cw8sj pod/root-access-build-1-build node/ip-10-0-137-182.ec2.internal container/sti-build container exited with code 1 (Error): 028cf\nCopying blob sha256:c77cd2c667dae6b0d198c11dac121b99e463042cd7d4d4de01c7e25dff5d1d0d\nCopying blob sha256:0ce57734b58e2e093bee378d47c1e9389a1d89f590e7f38cd5f2680a25a6da4e\nCopying config sha256:22db455832154891e5d61e26dadbc6fa09df409637c4678668c62f25cf4b02f6\nWriting manifest to image destination\nStoring signatures\nGenerating dockerfile with builder image image-registry.openshift-image-registry.svc:5000/e2e-test-build-s2i-dropcaps-cw8sj/rootable-ruby@sha256:16abb668af6a259ba3fc72b7e6b48e16d0c6774a7933b6d60fbb3b7e1eeff042\nSTEP 1: FROM image-registry.openshift-image-registry.svc:5000/e2e-test-build-s2i-dropcaps-cw8sj/rootable-ruby@sha256:16abb668af6a259ba3fc72b7e6b48e16d0c6774a7933b6d60fbb3b7e1eeff042\nSTEP 2: LABEL "io.openshift.build.image"="image-registry.openshift-image-registry.svc:5000/e2e-test-build-s2i-dropcaps-cw8sj/rootable-ruby@sha256:16abb668af6a259ba3fc72b7e6b48e16d0c6774a7933b6d60fbb3b7e1eeff042"       "io.openshift.build.commit.author"="Ben Parees <bparees@users.noreply.github.com>"       "io.openshift.build.commit.date"="Wed Nov 6 09:41:20 2019 -0500"       "io.openshift.build.commit.id"="57073c041d103a412ff7d4a6e64b0ea7f77ea1b3"       "io.openshift.build.commit.ref"="master"       "io.openshift.build.commit.message"="Merge pull request #85 from wewang58/master"       "io.openshift.build.source-location"="https://github.com/openshift/ruby-hello-world.git"\nSTEP 3: ENV RACK_ENV="production"     OPENSHIFT_BUILD_NAME="root-access-build-1"     OPENSHIFT_BUILD_NAMESPACE="e2e-test-build-s2i-dropcaps-cw8sj"     OPENSHIFT_BUILD_SOURCE="https://github.com/openshift/ruby-hello-world.git"     OPENSHIFT_BUILD_COMMIT="57073c041d103a412ff7d4a6e64b0ea7f77ea1b3"\nSTEP 4: USER root\nSTEP 5: COPY upload/src /tmp/src\nSTEP 6: RUN chown -R 1001:0 /tmp/src\nSTEP 7: USER 1001\nSTEP 8: RUN /usr/libexec/s2i/assemble\n/bin/sh: /usr/libexec/s2i/assemble: Permission denied\nsubprocess exited with status 126\nsubprocess exited with status 126\nerror: build error: error building at STEP "RUN /usr/libexec/s2i/assemble": exit status 126\n
Jun 26 16:37:14.574 E ns/e2e-test-build-webhooks-vhp5g pod/pushbuild-4-build node/ip-10-0-137-182.ec2.internal container/git-clone container exited with code 1 (Error): Cloning "http://my.docker/build" ...\nerror: fatal: unable to access 'http://my.docker/build/': Could not resolve host: my.docker; Unknown error\n
Jun 26 16:37:14.574 E ns/e2e-test-build-webhooks-vhp5g pod/pushbuild-4-build node/ip-10-0-137-182.ec2.internal reason/Failed (): 
Jun 26 16:37:14.574 E ns/e2e-test-build-webhooks-vhp5g pod/pushbuild-4-build node/ip-10-0-137-182.ec2.internal container/git-clone init container exited with code 1 (Error): Cloning "http://my.docker/build" ...\nerror: fatal: unable to access 'http://my.docker/build/': Could not resolve host: my.docker; Unknown error\n
Jun 26 16:37:14.592 E ns/e2e-test-build-webhooks-vhp5g pod/pushbuild-1-build node/ip-10-0-137-182.ec2.internal container/git-clone container exited with code 1 (Error): Cloning "http://my.docker/build" ...\nerror: fatal: unable to access 'http://my.docker/build/': Could not resolve host: my.docker; Unknown error\n
Jun 26 16:37:14.592 E ns/e2e-test-build-webhooks-vhp5g pod/pushbuild-1-build node/ip-10-0-137-182.ec2.internal reason/Failed (): 
Jun 26 16:37:14.592 E ns/e2e-test-build-webhooks-vhp5g pod/pushbuild-1-build node/ip-10-0-137-182.ec2.internal container/git-clone init container exited with code 1 (Error): Cloning "http://my.docker/build" ...\nerror: fatal: unable to access 'http://my.docker/build/': Could not resolve host: my.docker; Unknown error\n
Jun 26 16:37:15.648 E ns/e2e-test-build-webhooks-vhp5g pod/pushbuild-2-build node/ip-10-0-137-182.ec2.internal container/git-clone container exited with code 1 (Error): Cloning "http://my.docker/build" ...\nerror: fatal: unable to access 'http://my.docker/build/': Could not resolve host: my.docker; Unknown error\n
Jun 26 16:37:15.648 E ns/e2e-test-build-webhooks-vhp5g pod/pushbuild-2-build node/ip-10-0-137-182.ec2.internal reason/Failed (): 
Jun 26 16:37:15.648 E ns/e2e-test-build-webhooks-vhp5g pod/pushbuild-2-build node/ip-10-0-137-182.ec2.internal container/git-clone init container exited with code 1 (Error): Cloning "http://my.docker/build" ...\nerror: fatal: unable to access 'http://my.docker/build/': Could not resolve host: my.docker; Unknown error\n
Jun 26 16:37:20.677 E ns/e2e-test-cli-start-build-hn489 pod/docker-build-1-build node/ip-10-0-137-182.ec2.internal reason/Failed (DeadlineExceeded): Pod was active on the node longer than the specified deadline
Jun 26 16:37:21.689 E ns/e2e-test-cli-start-build-hn489 pod/docker-build-1-build node/ip-10-0-137-182.ec2.internal container/docker-build container exited with code 1 (Error): Caching blobs under "/var/cache/blobs".\n\nPulling image docker.io/busybox ...\nGetting image source signatures\nCopying blob sha256:76df9210b28cbd4bc127844914d0a23937ed213048dc6289b2a2d4f7d675c75e\nCopying config sha256:1c35c441208254cb7c3844ba95a96485388cef9ccc0646d562c7fc026e04c807\nWriting manifest to image destination\nStoring signatures\nError: received unexpected terminate signal\n
Jun 26 16:38:03.330 E ns/e2e-test-update-buildstatus-9kfwj pod/statusfail-builderimage-1-build node/ip-10-0-137-182.ec2.internal container/docker-build init container exited with code 255 (Error): un/secrets/openshift.io/pull/.dockerconfigjson\nI0626 16:37:52.074858       1 cfg.go:151] error reading file: open /var/run/secrets/openshift.io/pull/.dockerconfigjson: no such file or directory\nI0626 16:37:52.074869       1 daemonless.go:120] looking for .dockercfg at /var/run/secrets/openshift.io/pull/.dockercfg\nI0626 16:37:52.075053       1 daemonless.go:120] found valid .dockercfg at /var/run/secrets/openshift.io/pull/.dockercfg\nI0626 16:37:52.075362       1 config.go:107] looking for .dockercfg at /var/run/secrets/openshift.io/pull/.dockercfg\nI0626 16:37:52.076728       1 config.go:118] found .dockercfg at /var/run/secrets/openshift.io/pull/.dockercfg\nWarning: Pull failed, retrying in 5s ...\nAsked to pull fresh copy of "fail/me".\nI0626 16:37:57.262833       1 daemonless.go:120] looking for config.json at /var/run/secrets/openshift.io/pull/config.json\nI0626 16:37:57.262891       1 cfg.go:151] error reading file: open /var/run/secrets/openshift.io/pull/config.json: no such file or directory\nI0626 16:37:57.262904       1 daemonless.go:120] looking for .dockerconfigjson at /var/run/secrets/openshift.io/pull/.dockerconfigjson\nI0626 16:37:57.262923       1 cfg.go:151] error reading file: open /var/run/secrets/openshift.io/pull/.dockerconfigjson: no such file or directory\nI0626 16:37:57.262934       1 daemonless.go:120] looking for .dockercfg at /var/run/secrets/openshift.io/pull/.dockercfg\nI0626 16:37:57.263119       1 daemonless.go:120] found valid .dockercfg at /var/run/secrets/openshift.io/pull/.dockercfg\nI0626 16:37:57.263407       1 config.go:107] looking for .dockercfg at /var/run/secrets/openshift.io/pull/.dockercfg\nI0626 16:37:57.277478       1 config.go:118] found .dockercfg at /var/run/secrets/openshift.io/pull/.dockercfg\nWarning: Pull failed, retrying in 5s ...\nF0626 16:38:02.547715       1 helpers.go:115] error: build error: failed to pull image: After retrying 2 times, Pull image still failed due to error: errors:\ndenied: requested access to the resource is denied\nunauthorized: authentication required\n
Jun 26 16:38:03.330 E ns/e2e-test-update-buildstatus-9kfwj pod/statusfail-builderimage-1-build node/ip-10-0-137-182.ec2.internal reason/Failed (): 
Jun 26 16:38:03.330 E ns/e2e-test-update-buildstatus-9kfwj pod/statusfail-builderimage-1-build node/ip-10-0-137-182.ec2.internal container/docker-build container exited with code 255 (Error): un/secrets/openshift.io/pull/.dockerconfigjson\nI0626 16:37:52.074858       1 cfg.go:151] error reading file: open /var/run/secrets/openshift.io/pull/.dockerconfigjson: no such file or directory\nI0626 16:37:52.074869       1 daemonless.go:120] looking for .dockercfg at /var/run/secrets/openshift.io/pull/.dockercfg\nI0626 16:37:52.075053       1 daemonless.go:120] found valid .dockercfg at /var/run/secrets/openshift.io/pull/.dockercfg\nI0626 16:37:52.075362       1 config.go:107] looking for .dockercfg at /var/run/secrets/openshift.io/pull/.dockercfg\nI0626 16:37:52.076728       1 config.go:118] found .dockercfg at /var/run/secrets/openshift.io/pull/.dockercfg\nWarning: Pull failed, retrying in 5s ...\nAsked to pull fresh copy of "fail/me".\nI0626 16:37:57.262833       1 daemonless.go:120] looking for config.json at /var/run/secrets/openshift.io/pull/config.json\nI0626 16:37:57.262891       1 cfg.go:151] error reading file: open /var/run/secrets/openshift.io/pull/config.json: no such file or directory\nI0626 16:37:57.262904       1 daemonless.go:120] looking for .dockerconfigjson at /var/run/secrets/openshift.io/pull/.dockerconfigjson\nI0626 16:37:57.262923       1 cfg.go:151] error reading file: open /var/run/secrets/openshift.io/pull/.dockerconfigjson: no such file or directory\nI0626 16:37:57.262934       1 daemonless.go:120] looking for .dockercfg at /var/run/secrets/openshift.io/pull/.dockercfg\nI0626 16:37:57.263119       1 daemonless.go:120] found valid .dockercfg at /var/run/secrets/openshift.io/pull/.dockercfg\nI0626 16:37:57.263407       1 config.go:107] looking for .dockercfg at /var/run/secrets/openshift.io/pull/.dockercfg\nI0626 16:37:57.277478       1 config.go:118] found .dockercfg at /var/run/secrets/openshift.io/pull/.dockercfg\nWarning: Pull failed, retrying in 5s ...\nF0626 16:38:02.547715       1 helpers.go:115] error: build error: failed to pull image: After retrying 2 times, Pull image still failed due to error: errors:\ndenied: requested access to the resource is denied\nunauthorized: authentication required\n
Jun 26 16:38:21.491 E ns/e2e-test-cli-build-run-policy-cn5pm pod/sample-serial-build-fail-1-build node/ip-10-0-137-182.ec2.internal container/git-clone container exited with code 1 (Error): Cloning "git://github.com/openshift/invalidrepo.git" ...\nerror: requested repository "git://github.com/openshift/invalidrepo.git" not found\n
Jun 26 16:38:21.491 E ns/e2e-test-cli-build-run-policy-cn5pm pod/sample-serial-build-fail-1-build node/ip-10-0-137-182.ec2.internal reason/Failed (): 
Jun 26 16:38:21.491 E ns/e2e-test-cli-build-run-policy-cn5pm pod/sample-serial-build-fail-1-build node/ip-10-0-137-182.ec2.internal container/git-clone init container exited with code 1 (Error): Cloning "git://github.com/openshift/invalidrepo.git" ...\nerror: requested repository "git://github.com/openshift/invalidrepo.git" not found\n
Jun 26 16:38:26.683 E ns/e2e-test-cli-build-run-policy-cn5pm pod/sample-serial-build-fail-2-build node/ip-10-0-137-182.ec2.internal container/git-clone container exited with code 1 (Error): Cloning "git://github.com/openshift/invalidrepo.git" ...\nerror: requested repository "git://github.com/openshift/invalidrepo.git" not found\n
Jun 26 16:38:26.683 E ns/e2e-test-cli-build-run-policy-cn5pm pod/sample-serial-build-fail-2-build node/ip-10-0-137-182.ec2.internal reason/Failed (): 
Jun 26 16:38:26.683 E ns/e2e-test-cli-build-run-policy-cn5pm pod/sample-serial-build-fail-2-build node/ip-10-0-137-182.ec2.internal container/git-clone init container exited with code 1 (Error): Cloning "git://github.com/openshift/invalidrepo.git" ...\nerror: requested repository "git://github.com/openshift/invalidrepo.git" not found\n
Jun 26 16:38:31.072 E ns/e2e-test-cli-build-run-policy-cn5pm pod/sample-serial-build-fail-3-build node/ip-10-0-213-89.ec2.internal container/git-clone container exited with code 1 (Error): Cloning "git://github.com/openshift/invalidrepo.git" ...\nerror: requested repository "git://github.com/openshift/invalidrepo.git" not found\n
Jun 26 16:38:31.072 E ns/e2e-test-cli-build-run-policy-cn5pm pod/sample-serial-build-fail-3-build node/ip-10-0-213-89.ec2.internal reason/Failed (): 
Jun 26 16:38:31.072 E ns/e2e-test-cli-build-run-policy-cn5pm pod/sample-serial-build-fail-3-build node/ip-10-0-213-89.ec2.internal container/git-clone init container exited with code 1 (Error): Cloning "git://github.com/openshift/invalidrepo.git" ...\nerror: requested repository "git://github.com/openshift/invalidrepo.git" not found\n
Jun 26 16:38:31.200 E ns/e2e-test-cli-start-build-4dlbs pod/source-build-1-build node/ip-10-0-137-182.ec2.internal reason/Failed (DeadlineExceeded): Pod was active on the node longer than the specified deadline
Jun 26 16:38:35.322 E ns/e2e-test-cli-test-hooks-cklbk pod/mys2itest-4-build node/ip-10-0-137-182.ec2.internal container/sti-build init container exited with code 1 (Error): es2i:latest\nSTEP 1: FROM docker.io/openshift/test-build-simples2i:latest AS appimagef87d9f84fe024d8fa9d603254b2c2214\nSTEP 2: LABEL "io.openshift.build.image"="docker.io/openshift/test-build-simples2i:latest"       "io.openshift.build.commit.author"="Honza Horak <hhorak@redhat.com>"       "io.openshift.build.commit.date"="Tue Mar 3 16:35:01 2020 +0100"       "io.openshift.build.commit.id"="a096bd299d65517cef8079f4559e9b0b9f97ff57"       "io.openshift.build.commit.ref"="master"       "io.openshift.build.commit.message"="Merge pull request #237 from bparees/nodejs12"       "io.openshift.build.source-location"="https://github.com/sclorg/nodejs-ex"\nSTEP 3: ENV OPENSHIFT_BUILD_NAME="mys2itest-4"     OPENSHIFT_BUILD_NAMESPACE="e2e-test-cli-test-hooks-cklbk"     OPENSHIFT_BUILD_SOURCE="https://github.com/sclorg/nodejs-ex"     OPENSHIFT_BUILD_COMMIT="a096bd299d65517cef8079f4559e9b0b9f97ff57"\nSTEP 4: USER root\nSTEP 5: COPY upload/src /tmp/src\nSTEP 6: RUN chown -R 1001:0 /tmp/src\nSTEP 7: USER 1001\nSTEP 8: RUN /usr/libexec/s2i/assemble\nassembled!\nSTEP 9: CMD /usr/libexec/s2i/run\ntime="2020-06-26T16:38:33Z" level=info msg="Image operating system mismatch: image uses OS \"\"+architecture \"\", expecting one of \"linux+amd64\""\nGetting image source signatures\nCopying blob sha256:683f499823be212bf04cb9540407d8353803c25d0d9eb5f2fdb62786d8b95ead\nCopying blob sha256:7dd15ca0a0cc32cc3070771a31d9711cd5b8ec82be375cb07d027eb8335ec8c2\nCopying blob sha256:a1328498f4a9da5a5b5ffeadc22a7f13d0fcfab8871e0cc9c75e2dc4d0a1f980\nCopying config sha256:057e8a4958ce14fc12ebdbaf47265136cb526903cf4909598492e6deca5cf9bd\nWriting manifest to image destination\nStoring signatures\n--> 057e8a4958c\nSTEP 10: FROM 057e8a4958ce14fc12ebdbaf47265136cb526903cf4909598492e6deca5cf9bd\nSTEP 11: RUN /bin/sh -ic 'echo about to fail && false'\n/bin/sh: can't access tty; job control turned off\nabout to fail\nsubprocess exited with status 1\nsubprocess exited with status 1\nerror: build error: error building at STEP "RUN /bin/sh -ic 'echo about to fail && false'": exit status 1\n
Jun 26 16:38:35.322 E ns/e2e-test-cli-test-hooks-cklbk pod/mys2itest-4-build node/ip-10-0-137-182.ec2.internal reason/Failed (): 
Jun 26 16:38:35.322 E ns/e2e-test-cli-test-hooks-cklbk pod/mys2itest-4-build node/ip-10-0-137-182.ec2.internal container/sti-build container exited with code 1 (Error): es2i:latest\nSTEP 1: FROM docker.io/openshift/test-build-simples2i:latest AS appimagef87d9f84fe024d8fa9d603254b2c2214\nSTEP 2: LABEL "io.openshift.build.image"="docker.io/openshift/test-build-simples2i:latest"       "io.openshift.build.commit.author"="Honza Horak <hhorak@redhat.com>"       "io.openshift.build.commit.date"="Tue Mar 3 16:35:01 2020 +0100"       "io.openshift.build.commit.id"="a096bd299d65517cef8079f4559e9b0b9f97ff57"       "io.openshift.build.commit.ref"="master"       "io.openshift.build.commit.message"="Merge pull request #237 from bparees/nodejs12"       "io.openshift.build.source-location"="https://github.com/sclorg/nodejs-ex"\nSTEP 3: ENV OPENSHIFT_BUILD_NAME="mys2itest-4"     OPENSHIFT_BUILD_NAMESPACE="e2e-test-cli-test-hooks-cklbk"     OPENSHIFT_BUILD_SOURCE="https://github.com/sclorg/nodejs-ex"     OPENSHIFT_BUILD_COMMIT="a096bd299d65517cef8079f4559e9b0b9f97ff57"\nSTEP 4: USER root\nSTEP 5: COPY upload/src /tmp/src\nSTEP 6: RUN chown -R 1001:0 /tmp/src\nSTEP 7: USER 1001\nSTEP 8: RUN /usr/libexec/s2i/assemble\nassembled!\nSTEP 9: CMD /usr/libexec/s2i/run\ntime="2020-06-26T16:38:33Z" level=info msg="Image operating system mismatch: image uses OS \"\"+architecture \"\", expecting one of \"linux+amd64\""\nGetting image source signatures\nCopying blob sha256:683f499823be212bf04cb9540407d8353803c25d0d9eb5f2fdb62786d8b95ead\nCopying blob sha256:7dd15ca0a0cc32cc3070771a31d9711cd5b8ec82be375cb07d027eb8335ec8c2\nCopying blob sha256:a1328498f4a9da5a5b5ffeadc22a7f13d0fcfab8871e0cc9c75e2dc4d0a1f980\nCopying config sha256:057e8a4958ce14fc12ebdbaf47265136cb526903cf4909598492e6deca5cf9bd\nWriting manifest to image destination\nStoring signatures\n--> 057e8a4958c\nSTEP 10: FROM 057e8a4958ce14fc12ebdbaf47265136cb526903cf4909598492e6deca5cf9bd\nSTEP 11: RUN /bin/sh -ic 'echo about to fail && false'\n/bin/sh: can't access tty; job control turned off\nabout to fail\nsubprocess exited with status 1\nsubprocess exited with status 1\nerror: build error: error building at STEP "RUN /bin/sh -ic 'echo about to fail && false'": exit status 1\n
Jun 26 16:38:49.390 E ns/e2e-test-cli-test-hooks-cklbk pod/mys2itest-5-build node/ip-10-0-137-182.ec2.internal container/sti-build init container exited with code 1 (Error): es2i:latest\nReplaced Dockerfile FROM image docker.io/openshift/test-build-simples2i:latest\nSTEP 1: FROM docker.io/openshift/test-build-simples2i:latest AS appimage03de07f7020e4270bd795e3c2954b9d4\nSTEP 2: LABEL "io.openshift.build.commit.author"="Honza Horak <hhorak@redhat.com>"       "io.openshift.build.commit.date"="Tue Mar 3 16:35:01 2020 +0100"       "io.openshift.build.commit.id"="a096bd299d65517cef8079f4559e9b0b9f97ff57"       "io.openshift.build.commit.ref"="master"       "io.openshift.build.commit.message"="Merge pull request #237 from bparees/nodejs12"       "io.openshift.build.source-location"="https://github.com/sclorg/nodejs-ex"       "io.openshift.build.image"="docker.io/openshift/test-build-simples2i:latest"\nSTEP 3: ENV OPENSHIFT_BUILD_NAME="mys2itest-5"     OPENSHIFT_BUILD_NAMESPACE="e2e-test-cli-test-hooks-cklbk"     OPENSHIFT_BUILD_SOURCE="https://github.com/sclorg/nodejs-ex"     OPENSHIFT_BUILD_COMMIT="a096bd299d65517cef8079f4559e9b0b9f97ff57"\nSTEP 4: USER root\nSTEP 5: COPY upload/src /tmp/src\nSTEP 6: RUN chown -R 1001:0 /tmp/src\nSTEP 7: USER 1001\nSTEP 8: RUN /usr/libexec/s2i/assemble\nassembled!\nSTEP 9: CMD /usr/libexec/s2i/run\ntime="2020-06-26T16:38:47Z" level=info msg="Image operating system mismatch: image uses OS \"\"+architecture \"\", expecting one of \"linux+amd64\""\nGetting image source signatures\nCopying blob sha256:683f499823be212bf04cb9540407d8353803c25d0d9eb5f2fdb62786d8b95ead\nCopying blob sha256:7dd15ca0a0cc32cc3070771a31d9711cd5b8ec82be375cb07d027eb8335ec8c2\nCopying blob sha256:4b99cdfdc699a13b86cb07764674d1f3506ca10664162b4ca83a7ff7284f1743\nCopying config sha256:1401e72af6898b2d4683a7c4b6f6a931802c456f28811377ff0fc2e04d0faf8a\nWriting manifest to image destination\nStoring signatures\n--> 1401e72af68\nSTEP 10: FROM 1401e72af6898b2d4683a7c4b6f6a931802c456f28811377ff0fc2e04d0faf8a\nSTEP 11: RUN sh -c echo about to fail && false\n\nsubprocess exited with status 1\nsubprocess exited with status 1\nerror: build error: error building at STEP "RUN sh -c echo about to fail && false": exit status 1\n
Jun 26 16:38:49.390 E ns/e2e-test-cli-test-hooks-cklbk pod/mys2itest-5-build node/ip-10-0-137-182.ec2.internal reason/Failed (): 
Jun 26 16:38:49.390 E ns/e2e-test-cli-test-hooks-cklbk pod/mys2itest-5-build node/ip-10-0-137-182.ec2.internal container/sti-build container exited with code 1 (Error): es2i:latest\nReplaced Dockerfile FROM image docker.io/openshift/test-build-simples2i:latest\nSTEP 1: FROM docker.io/openshift/test-build-simples2i:latest AS appimage03de07f7020e4270bd795e3c2954b9d4\nSTEP 2: LABEL "io.openshift.build.commit.author"="Honza Horak <hhorak@redhat.com>"       "io.openshift.build.commit.date"="Tue Mar 3 16:35:01 2020 +0100"       "io.openshift.build.commit.id"="a096bd299d65517cef8079f4559e9b0b9f97ff57"       "io.openshift.build.commit.ref"="master"       "io.openshift.build.commit.message"="Merge pull request #237 from bparees/nodejs12"       "io.openshift.build.source-location"="https://github.com/sclorg/nodejs-ex"       "io.openshift.build.image"="docker.io/openshift/test-build-simples2i:latest"\nSTEP 3: ENV OPENSHIFT_BUILD_NAME="mys2itest-5"     OPENSHIFT_BUILD_NAMESPACE="e2e-test-cli-test-hooks-cklbk"     OPENSHIFT_BUILD_SOURCE="https://github.com/sclorg/nodejs-ex"     OPENSHIFT_BUILD_COMMIT="a096bd299d65517cef8079f4559e9b0b9f97ff57"\nSTEP 4: USER root\nSTEP 5: COPY upload/src /tmp/src\nSTEP 6: RUN chown -R 1001:0 /tmp/src\nSTEP 7: USER 1001\nSTEP 8: RUN /usr/libexec/s2i/assemble\nassembled!\nSTEP 9: CMD /usr/libexec/s2i/run\ntime="2020-06-26T16:38:47Z" level=info msg="Image operating system mismatch: image uses OS \"\"+architecture \"\", expecting one of \"linux+amd64\""\nGetting image source signatures\nCopying blob sha256:683f499823be212bf04cb9540407d8353803c25d0d9eb5f2fdb62786d8b95ead\nCopying blob sha256:7dd15ca0a0cc32cc3070771a31d9711cd5b8ec82be375cb07d027eb8335ec8c2\nCopying blob sha256:4b99cdfdc699a13b86cb07764674d1f3506ca10664162b4ca83a7ff7284f1743\nCopying config sha256:1401e72af6898b2d4683a7c4b6f6a931802c456f28811377ff0fc2e04d0faf8a\nWriting manifest to image destination\nStoring signatures\n--> 1401e72af68\nSTEP 10: FROM 1401e72af6898b2d4683a7c4b6f6a931802c456f28811377ff0fc2e04d0faf8a\nSTEP 11: RUN sh -c echo about to fail && false\n\nsubprocess exited with status 1\nsubprocess exited with status 1\nerror: build error: error building at STEP "RUN sh -c echo about to fail && false": exit status 1\n
Jun 26 16:40:07.504 E ns/e2e-test-cli-test-hooks-cklbk pod/mys2itest-6-build node/ip-10-0-137-182.ec2.internal container/sti-build init container exited with code 1 (Error): es2i:latest\nReplaced Dockerfile FROM image docker.io/openshift/test-build-simples2i:latest\nSTEP 1: FROM docker.io/openshift/test-build-simples2i:latest AS appimage75716d5050214df8b27423aa74ebdd26\nSTEP 2: LABEL "io.openshift.build.commit.id"="a096bd299d65517cef8079f4559e9b0b9f97ff57"       "io.openshift.build.commit.ref"="master"       "io.openshift.build.commit.message"="Merge pull request #237 from bparees/nodejs12"       "io.openshift.build.source-location"="https://github.com/sclorg/nodejs-ex"       "io.openshift.build.image"="docker.io/openshift/test-build-simples2i:latest"       "io.openshift.build.commit.author"="Honza Horak <hhorak@redhat.com>"       "io.openshift.build.commit.date"="Tue Mar 3 16:35:01 2020 +0100"\nSTEP 3: ENV OPENSHIFT_BUILD_NAME="mys2itest-6"     OPENSHIFT_BUILD_NAMESPACE="e2e-test-cli-test-hooks-cklbk"     OPENSHIFT_BUILD_SOURCE="https://github.com/sclorg/nodejs-ex"     OPENSHIFT_BUILD_COMMIT="a096bd299d65517cef8079f4559e9b0b9f97ff57"\nSTEP 4: USER root\nSTEP 5: COPY upload/src /tmp/src\nSTEP 6: RUN chown -R 1001:0 /tmp/src\nSTEP 7: USER 1001\nSTEP 8: RUN /usr/libexec/s2i/assemble\nassembled!\nSTEP 9: CMD /usr/libexec/s2i/run\ntime="2020-06-26T16:39:42Z" level=info msg="Image operating system mismatch: image uses OS \"\"+architecture \"\", expecting one of \"linux+amd64\""\nGetting image source signatures\nCopying blob sha256:683f499823be212bf04cb9540407d8353803c25d0d9eb5f2fdb62786d8b95ead\nCopying blob sha256:7dd15ca0a0cc32cc3070771a31d9711cd5b8ec82be375cb07d027eb8335ec8c2\nCopying blob sha256:b0f3d59cdd0175e9f8e93ba18dc9c6cdd2e2040214b9443bf940a59ff2108415\nCopying config sha256:4df033339550fb4c9e90fcd6e86435dc8e48abf357374600b402656a5e6fb216\nWriting manifest to image destination\nStoring signatures\n--> 4df03333955\nSTEP 10: FROM 4df033339550fb4c9e90fcd6e86435dc8e48abf357374600b402656a5e6fb216\nSTEP 11: RUN sh -c echo about to fail && false\n\nsubprocess exited with status 1\nsubprocess exited with status 1\nerror: build error: error building at STEP "RUN sh -c echo about to fail && false": exit status 1\n
Jun 26 16:40:07.504 E ns/e2e-test-cli-test-hooks-cklbk pod/mys2itest-6-build node/ip-10-0-137-182.ec2.internal reason/Failed (): 
Jun 26 16:40:07.504 E ns/e2e-test-cli-test-hooks-cklbk pod/mys2itest-6-build node/ip-10-0-137-182.ec2.internal container/sti-build container exited with code 1 (Error): es2i:latest\nReplaced Dockerfile FROM image docker.io/openshift/test-build-simples2i:latest\nSTEP 1: FROM docker.io/openshift/test-build-simples2i:latest AS appimage75716d5050214df8b27423aa74ebdd26\nSTEP 2: LABEL "io.openshift.build.commit.id"="a096bd299d65517cef8079f4559e9b0b9f97ff57"       "io.openshift.build.commit.ref"="master"       "io.openshift.build.commit.message"="Merge pull request #237 from bparees/nodejs12"       "io.openshift.build.source-location"="https://github.com/sclorg/nodejs-ex"       "io.openshift.build.image"="docker.io/openshift/test-build-simples2i:latest"       "io.openshift.build.commit.author"="Honza Horak <hhorak@redhat.com>"       "io.openshift.build.commit.date"="Tue Mar 3 16:35:01 2020 +0100"\nSTEP 3: ENV OPENSHIFT_BUILD_NAME="mys2itest-6"     OPENSHIFT_BUILD_NAMESPACE="e2e-test-cli-test-hooks-cklbk"     OPENSHIFT_BUILD_SOURCE="https://github.com/sclorg/nodejs-ex"     OPENSHIFT_BUILD_COMMIT="a096bd299d65517cef8079f4559e9b0b9f97ff57"\nSTEP 4: USER root\nSTEP 5: COPY upload/src /tmp/src\nSTEP 6: RUN chown -R 1001:0 /tmp/src\nSTEP 7: USER 1001\nSTEP 8: RUN /usr/libexec/s2i/assemble\nassembled!\nSTEP 9: CMD /usr/libexec/s2i/run\ntime="2020-06-26T16:39:42Z" level=info msg="Image operating system mismatch: image uses OS \"\"+architecture \"\", expecting one of \"linux+amd64\""\nGetting image source signatures\nCopying blob sha256:683f499823be212bf04cb9540407d8353803c25d0d9eb5f2fdb62786d8b95ead\nCopying blob sha256:7dd15ca0a0cc32cc3070771a31d9711cd5b8ec82be375cb07d027eb8335ec8c2\nCopying blob sha256:b0f3d59cdd0175e9f8e93ba18dc9c6cdd2e2040214b9443bf940a59ff2108415\nCopying config sha256:4df033339550fb4c9e90fcd6e86435dc8e48abf357374600b402656a5e6fb216\nWriting manifest to image destination\nStoring signatures\n--> 4df03333955\nSTEP 10: FROM 4df033339550fb4c9e90fcd6e86435dc8e48abf357374600b402656a5e6fb216\nSTEP 11: RUN sh -c echo about to fail && false\n\nsubprocess exited with status 1\nsubprocess exited with status 1\nerror: build error: error building at STEP "RUN sh -c echo about to fail && false": exit status 1\n
Jun 26 16:40:32.111 E ns/e2e-test-update-buildstatus-8f4hr pod/statusfail-fetchimagecontentdocker-1-build node/ip-10-0-137-182.ec2.internal container/extract-image-content container exited with code 255 (Error): ge/0/.dockercfg'\nUsing Docker config file /var/run/secrets/openshift.io/source-image/0/.dockercfg\nI0626 16:40:30.692036       1 source.go:178] Setting authentication for registry "image-registry.openshift-image-registry.svc:5000" using "image-registry.openshift-image-registry.svc:5000".\nI0626 16:40:30.692660       1 source.go:178] Setting authentication for registry "quay.io/openshift-cnv-dev" using "quay.io/openshift-cnv-dev".\nI0626 16:40:30.695828       1 source.go:178] Setting authentication for registry "cloud.openshift.com" using "cloud.openshift.com".\nI0626 16:40:30.697834       1 source.go:178] Setting authentication for registry "quay.io/openshift-cnv" using "quay.io/openshift-cnv".\nI0626 16:40:30.701826       1 source.go:178] Setting authentication for registry "image-registry.openshift-image-registry.svc.cluster.local:5000" using "image-registry.openshift-image-registry.svc.cluster.local:5000".\nI0626 16:40:30.723664       1 source.go:178] Setting authentication for registry "default-route-openshift-image-registry.apps.build01.ci.devcluster.openshift.com" using "default-route-openshift-image-registry.apps.build01.ci.devcluster.openshift.com".\nI0626 16:40:30.731779       1 source.go:178] Setting authentication for registry "172.30.169.4:5000" using "172.30.169.4:5000".\nI0626 16:40:30.746861       1 source.go:178] Setting authentication for registry "quay.io" using "quay.io".\nI0626 16:40:30.750189       1 source.go:178] Setting authentication for registry "registry.connect.redhat.com" using "registry.connect.redhat.com".\nI0626 16:40:30.751902       1 source.go:178] Setting authentication for registry "registry.redhat.io" using "registry.redhat.io".\nI0626 16:40:30.754171       1 source.go:178] Setting authentication for registry "registry.svc.ci.openshift.org" using "registry.svc.ci.openshift.org".\nF0626 16:40:31.218782       1 helpers.go:115] error: error creating buildah builder: Error initializing image from source docker://dummy.io/dont/exist:latest: invalid character '<' looking for beginning of value\n
Jun 26 16:40:32.111 E ns/e2e-test-update-buildstatus-8f4hr pod/statusfail-fetchimagecontentdocker-1-build node/ip-10-0-137-182.ec2.internal reason/Failed (): 
Jun 26 16:40:32.111 E ns/e2e-test-update-buildstatus-8f4hr pod/statusfail-fetchimagecontentdocker-1-build node/ip-10-0-137-182.ec2.internal container/extract-image-content init container exited with code 255 (Error): ge/0/.dockercfg'\nUsing Docker config file /var/run/secrets/openshift.io/source-image/0/.dockercfg\nI0626 16:40:30.692036       1 source.go:178] Setting authentication for registry "image-registry.openshift-image-registry.svc:5000" using "image-registry.openshift-image-registry.svc:5000".\nI0626 16:40:30.692660       1 source.go:178] Setting authentication for registry "quay.io/openshift-cnv-dev" using "quay.io/openshift-cnv-dev".\nI0626 16:40:30.695828       1 source.go:178] Setting authentication for registry "cloud.openshift.com" using "cloud.openshift.com".\nI0626 16:40:30.697834       1 source.go:178] Setting authentication for registry "quay.io/openshift-cnv" using "quay.io/openshift-cnv".\nI0626 16:40:30.701826       1 source.go:178] Setting authentication for registry "image-registry.openshift-image-registry.svc.cluster.local:5000" using "image-registry.openshift-image-registry.svc.cluster.local:5000".\nI0626 16:40:30.723664       1 source.go:178] Setting authentication for registry "default-route-openshift-image-registry.apps.build01.ci.devcluster.openshift.com" using "default-route-openshift-image-registry.apps.build01.ci.devcluster.openshift.com".\nI0626 16:40:30.731779       1 source.go:178] Setting authentication for registry "172.30.169.4:5000" using "172.30.169.4:5000".\nI0626 16:40:30.746861       1 source.go:178] Setting authentication for registry "quay.io" using "quay.io".\nI0626 16:40:30.750189       1 source.go:178] Setting authentication for registry "registry.connect.redhat.com" using "registry.connect.redhat.com".\nI0626 16:40:30.751902       1 source.go:178] Setting authentication for registry "registry.redhat.io" using "registry.redhat.io".\nI0626 16:40:30.754171       1 source.go:178] Setting authentication for registry "registry.svc.ci.openshift.org" using "registry.svc.ci.openshift.org".\nF0626 16:40:31.218782       1 helpers.go:115] error: error creating buildah builder: Error initializing image from source docker://dummy.io/dont/exist:latest: invalid character '<' looking for beginning of value\n
Jun 26 16:41:05.457 E ns/e2e-test-build-dockerfile-env-4xvvj pod/centos-1-build node/ip-10-0-213-89.ec2.internal container/docker-build init container exited with code 1 (Error): Caching blobs under "/var/cache/blobs".\n\nPulling image centos:7 ...\nGetting image source signatures\nCopying blob sha256:524b0c1e57f8ee5fee01a1decba2f301c324a6513ca3551021264e3aa7341ebc\nCopying config sha256:b5b4d78bc90ccd15806443fb881e35b5ddba924e2f475c1071a38a3094c3081d\nWriting manifest to image destination\nStoring signatures\nSTEP 1: FROM centos:7\nSTEP 2: ADD no-exist-file .\nerror: build error: error dry-running "ADD no-exist-file .": no files found matching "/tmp/build/inputs/no-exist-file": no such file or directory\n
Jun 26 16:41:05.457 E ns/e2e-test-build-dockerfile-env-4xvvj pod/centos-1-build node/ip-10-0-213-89.ec2.internal reason/Failed (): 
Jun 26 16:41:05.457 E ns/e2e-test-build-dockerfile-env-4xvvj pod/centos-1-build node/ip-10-0-213-89.ec2.internal container/docker-build container exited with code 1 (Error): Caching blobs under "/var/cache/blobs".\n\nPulling image centos:7 ...\nGetting image source signatures\nCopying blob sha256:524b0c1e57f8ee5fee01a1decba2f301c324a6513ca3551021264e3aa7341ebc\nCopying config sha256:b5b4d78bc90ccd15806443fb881e35b5ddba924e2f475c1071a38a3094c3081d\nWriting manifest to image destination\nStoring signatures\nSTEP 1: FROM centos:7\nSTEP 2: ADD no-exist-file .\nerror: build error: error dry-running "ADD no-exist-file .": no files found matching "/tmp/build/inputs/no-exist-file": no such file or directory\n
Jun 26 16:41:11.551 E ns/e2e-test-update-buildstatus-jh2nq pod/statusfail-badcontextdirsourcetoimage-1-build node/ip-10-0-137-182.ec2.internal container/git-clone container exited with code 255 (Error): 41:10.876233       1 repository.go:424] Executing git rev-parse --abbrev-ref HEAD\nI0626 16:41:10.877779       1 repository.go:424] Executing git rev-parse --verify HEAD\nI0626 16:41:10.879103       1 repository.go:424] Executing git --no-pager show -s --format=%an HEAD\nI0626 16:41:10.880788       1 repository.go:424] Executing git --no-pager show -s --format=%ae HEAD\nI0626 16:41:10.882416       1 repository.go:424] Executing git --no-pager show -s --format=%cn HEAD\nI0626 16:41:10.884060       1 repository.go:424] Executing git --no-pager show -s --format=%ce HEAD\nI0626 16:41:10.885687       1 repository.go:424] Executing git --no-pager show -s --format=%ad HEAD\nI0626 16:41:10.887323       1 repository.go:424] Executing git --no-pager show -s --format=%<(80,trunc)%s HEAD\nI0626 16:41:10.888885       1 repository.go:424] Executing git config --get remote.origin.url\n	Commit:	57073c041d103a412ff7d4a6e64b0ea7f77ea1b3 (Merge pull request #85 from wewang58/master)\n	Author:	Ben Parees <bparees@users.noreply.github.com>\n	Date:	Wed Nov 6 09:41:20 2019 -0500\nI0626 16:41:10.890171       1 repository.go:424] Executing git rev-parse --abbrev-ref HEAD\nI0626 16:41:10.891443       1 repository.go:424] Executing git rev-parse --verify HEAD\nI0626 16:41:10.892720       1 repository.go:424] Executing git --no-pager show -s --format=%an HEAD\nI0626 16:41:10.894242       1 repository.go:424] Executing git --no-pager show -s --format=%ae HEAD\nI0626 16:41:10.895774       1 repository.go:424] Executing git --no-pager show -s --format=%cn HEAD\nI0626 16:41:10.897289       1 repository.go:424] Executing git --no-pager show -s --format=%ce HEAD\nI0626 16:41:10.898858       1 repository.go:424] Executing git --no-pager show -s --format=%ad HEAD\nI0626 16:41:10.900424       1 repository.go:424] Executing git --no-pager show -s --format=%<(80,trunc)%s HEAD\nI0626 16:41:10.902034       1 repository.go:424] Executing git config --get remote.origin.url\nF0626 16:41:10.939289       1 helpers.go:115] error: provided context directory does not exist: foobar\n
Jun 26 16:41:11.551 E ns/e2e-test-update-buildstatus-jh2nq pod/statusfail-badcontextdirsourcetoimage-1-build node/ip-10-0-137-182.ec2.internal reason/Failed (): 
Jun 26 16:41:11.551 E ns/e2e-test-update-buildstatus-jh2nq pod/statusfail-badcontextdirsourcetoimage-1-build node/ip-10-0-137-182.ec2.internal container/git-clone init container exited with code 255 (Error): 41:10.876233       1 repository.go:424] Executing git rev-parse --abbrev-ref HEAD\nI0626 16:41:10.877779       1 repository.go:424] Executing git rev-parse --verify HEAD\nI0626 16:41:10.879103       1 repository.go:424] Executing git --no-pager show -s --format=%an HEAD\nI0626 16:41:10.880788       1 repository.go:424] Executing git --no-pager show -s --format=%ae HEAD\nI0626 16:41:10.882416       1 repository.go:424] Executing git --no-pager show -s --format=%cn HEAD\nI0626 16:41:10.884060       1 repository.go:424] Executing git --no-pager show -s --format=%ce HEAD\nI0626 16:41:10.885687       1 repository.go:424] Executing git --no-pager show -s --format=%ad HEAD\nI0626 16:41:10.887323       1 repository.go:424] Executing git --no-pager show -s --format=%<(80,trunc)%s HEAD\nI0626 16:41:10.888885       1 repository.go:424] Executing git config --get remote.origin.url\n	Commit:	57073c041d103a412ff7d4a6e64b0ea7f77ea1b3 (Merge pull request #85 from wewang58/master)\n	Author:	Ben Parees <bparees@users.noreply.github.com>\n	Date:	Wed Nov 6 09:41:20 2019 -0500\nI0626 16:41:10.890171       1 repository.go:424] Executing git rev-parse --abbrev-ref HEAD\nI0626 16:41:10.891443       1 repository.go:424] Executing git rev-parse --verify HEAD\nI0626 16:41:10.892720       1 repository.go:424] Executing git --no-pager show -s --format=%an HEAD\nI0626 16:41:10.894242       1 repository.go:424] Executing git --no-pager show -s --format=%ae HEAD\nI0626 16:41:10.895774       1 repository.go:424] Executing git --no-pager show -s --format=%cn HEAD\nI0626 16:41:10.897289       1 repository.go:424] Executing git --no-pager show -s --format=%ce HEAD\nI0626 16:41:10.898858       1 repository.go:424] Executing git --no-pager show -s --format=%ad HEAD\nI0626 16:41:10.900424       1 repository.go:424] Executing git --no-pager show -s --format=%<(80,trunc)%s HEAD\nI0626 16:41:10.902034       1 repository.go:424] Executing git config --get remote.origin.url\nF0626 16:41:10.939289       1 helpers.go:115] error: provided context directory does not exist: foobar\n
Jun 26 16:41:16.555 E ns/e2e-test-build-sti-env-sjlcl pod/build-test-pod node/ip-10-0-137-182.ec2.internal container/test container exited with code 1 (Error): 
Jun 26 16:41:29.046 E ns/e2e-test-cli-test-hooks-cklbk pod/mys2itest-1-2rkbx node/ip-10-0-161-222.ec2.internal container/mys2itest container exited with code 137 (Error): 
Jun 26 16:41:33.453 E ns/e2e-test-cli-build-run-policy-kq2vs pod/sample-parallel-build-2-build node/ip-10-0-137-182.ec2.internal container/manage-dockerfile init container exited with code 137 (ContainerStatusUnknown): The container could not be located when the pod was terminated
Jun 26 16:41:34.666 E ns/e2e-test-cli-build-run-policy-kq2vs pod/sample-parallel-build-3-build node/ip-10-0-213-89.ec2.internal container/manage-dockerfile init container exited with code 137 (ContainerStatusUnknown): The container could not be located when the pod was terminated
Jun 26 16:41:36.944 E ns/e2e-test-cli-start-build-slvpk pod/sample-build-1-build node/ip-10-0-137-182.ec2.internal container/git-clone container exited with code 255 (Error): :[{"type":"New","status":"True","lastUpdateTime":"2020-06-26T16:41:31Z","lastTransitionTime":"2020-06-26T16:41:31Z"}]}}\nCloning "git://github.com/openshift/ruby-hello-world.git" ...\nI0626 16:41:36.069366       1 source.go:237] git ls-remote --heads git://github.com/openshift/ruby-hello-world.git\nI0626 16:41:36.069388       1 repository.go:424] Executing git ls-remote --heads git://github.com/openshift/ruby-hello-world.git\nI0626 16:41:36.225724       1 source.go:237] cf1fa898d2a78685ccde72f14b4922b474f73cd1	refs/heads/beta2\n2602ace61490de0513dfbd7c7de949356cf9bd17	refs/heads/beta3\n394e0f7c0446d65d163ecae9cf5b559ad60de6dd	refs/heads/beta4\n11e9bbac1dcf5a06df07f5a6ab893a3cb9448011	refs/heads/blog_part1\n5619f11232c0a623f7da419438539335d49acfa3	refs/heads/config\n57073c041d103a412ff7d4a6e64b0ea7f77ea1b3	refs/heads/master\n9f70e0daf56b57d7f3cc012020df06ba7f914d0f	refs/heads/revert-64-feature/fix-for-ruby-2.5-compatibility\nffa3f8596f3f82c0ee224f1b1d0c23102b1ad1f1	refs/heads/revert-66-feature/fix-for-ruby-2.5-compatibility-with-ci\nd71bdd56df54d7400e1f72dc0929280e43627138	refs/heads/revert-69-gemfile\nfaccd39c6857edb7a3015cc6837fb347613f23c3	refs/heads/undo\nI0626 16:41:36.225755       1 source.go:69] Cloning source from git://github.com/openshift/ruby-hello-world.git\nI0626 16:41:36.225791       1 repository.go:424] Executing git clone git://github.com/openshift/ruby-hello-world.git /tmp/build/inputs\nI0626 16:41:36.510674       1 repository.go:424] Executing git checkout fffffff --\nI0626 16:41:36.515643       1 repository.go:484] Error executing command: exit status 128\nI0626 16:41:36.515699       1 repository.go:173] Checkout after clone failed for ref fffffff with error: fatal: invalid reference: fffffff, attempting fetch\nI0626 16:41:36.515712       1 repository.go:424] Executing git fetch git://github.com/openshift/ruby-hello-world.git fffffff\nI0626 16:41:36.601712       1 repository.go:484] Error executing command: exit status 128\nF0626 16:41:36.689981       1 helpers.go:115] error: fatal: Couldn't find remote ref fffffff\n
Jun 26 16:41:36.944 E ns/e2e-test-cli-start-build-slvpk pod/sample-build-1-build node/ip-10-0-137-182.ec2.internal reason/Failed (): 
Jun 26 16:41:36.944 E ns/e2e-test-cli-start-build-slvpk pod/sample-build-1-build node/ip-10-0-137-182.ec2.internal container/git-clone init container exited with code 255 (Error): :[{"type":"New","status":"True","lastUpdateTime":"2020-06-26T16:41:31Z","lastTransitionTime":"2020-06-26T16:41:31Z"}]}}\nCloning "git://github.com/openshift/ruby-hello-world.git" ...\nI0626 16:41:36.069366       1 source.go:237] git ls-remote --heads git://github.com/openshift/ruby-hello-world.git\nI0626 16:41:36.069388       1 repository.go:424] Executing git ls-remote --heads git://github.com/openshift/ruby-hello-world.git\nI0626 16:41:36.225724       1 source.go:237] cf1fa898d2a78685ccde72f14b4922b474f73cd1	refs/heads/beta2\n2602ace61490de0513dfbd7c7de949356cf9bd17	refs/heads/beta3\n394e0f7c0446d65d163ecae9cf5b559ad60de6dd	refs/heads/beta4\n11e9bbac1dcf5a06df07f5a6ab893a3cb9448011	refs/heads/blog_part1\n5619f11232c0a623f7da419438539335d49acfa3	refs/heads/config\n57073c041d103a412ff7d4a6e64b0ea7f77ea1b3	refs/heads/master\n9f70e0daf56b57d7f3cc012020df06ba7f914d0f	refs/heads/revert-64-feature/fix-for-ruby-2.5-compatibility\nffa3f8596f3f82c0ee224f1b1d0c23102b1ad1f1	refs/heads/revert-66-feature/fix-for-ruby-2.5-compatibility-with-ci\nd71bdd56df54d7400e1f72dc0929280e43627138	refs/heads/revert-69-gemfile\nfaccd39c6857edb7a3015cc6837fb347613f23c3	refs/heads/undo\nI0626 16:41:36.225755       1 source.go:69] Cloning source from git://github.com/openshift/ruby-hello-world.git\nI0626 16:41:36.225791       1 repository.go:424] Executing git clone git://github.com/openshift/ruby-hello-world.git /tmp/build/inputs\nI0626 16:41:36.510674       1 repository.go:424] Executing git checkout fffffff --\nI0626 16:41:36.515643       1 repository.go:484] Error executing command: exit status 128\nI0626 16:41:36.515699       1 repository.go:173] Checkout after clone failed for ref fffffff with error: fatal: invalid reference: fffffff, attempting fetch\nI0626 16:41:36.515712       1 repository.go:424] Executing git fetch git://github.com/openshift/ruby-hello-world.git fffffff\nI0626 16:41:36.601712       1 repository.go:484] Error executing command: exit status 128\nF0626 16:41:36.689981       1 helpers.go:115] error: fatal: Couldn't find remote ref fffffff\n
Jun 26 16:41:56.161 E ns/e2e-test-update-buildstatus-669hm pod/statusfail-assemblescript-1-build node/ip-10-0-161-222.ec2.internal container/sti-build init container exited with code 1 (Error): Caching blobs under "/var/cache/blobs".\nGetting image source signatures\nCopying blob sha256:0bf89df3706d10631e090fa364fcbb28b84f7ef6fd419a72dbe3c50ec9cdcf1b\nCopying blob sha256:57c14dd66db0390dbf6da578421c077f6de8e88edd0815b4caa94607ba5f4c09\nCopying config sha256:ef0b9da9b21de4aec1217f962bdecf73ddb7c4d3d007656df193e1d287096da8\nWriting manifest to image destination\nStoring signatures\nGenerating dockerfile with builder image docker.io/openshift/test-build-simples2i:latest\nSTEP 1: FROM docker.io/openshift/test-build-simples2i:latest\nSTEP 2: LABEL "io.openshift.build.image"="docker.io/openshift/test-build-simples2i:latest"       "io.openshift.build.source-location"="/tmp/build/inputs"\nSTEP 3: ENV OPENSHIFT_BUILD_NAME="statusfail-assemblescript-1"     OPENSHIFT_BUILD_NAMESPACE="e2e-test-update-buildstatus-669hm"\nSTEP 4: USER root\nSTEP 5: COPY upload/scripts /tmp/scripts\nSTEP 6: COPY upload/src /tmp/src\nSTEP 7: RUN chown -R 1001:0 /tmp/scripts /tmp/src\nSTEP 8: USER 1001\nSTEP 9: RUN /tmp/scripts/assemble\n/bin/sh: /tmp/scripts/assemble: not found\nsubprocess exited with status 127\nsubprocess exited with status 127\nerror: build error: error building at STEP "RUN /tmp/scripts/assemble": exit status 127\n
Jun 26 16:41:56.161 E ns/e2e-test-update-buildstatus-669hm pod/statusfail-assemblescript-1-build node/ip-10-0-161-222.ec2.internal reason/Failed (): 
Jun 26 16:41:56.161 E ns/e2e-test-update-buildstatus-669hm pod/statusfail-assemblescript-1-build node/ip-10-0-161-222.ec2.internal container/sti-build container exited with code 1 (Error): Caching blobs under "/var/cache/blobs".\nGetting image source signatures\nCopying blob sha256:0bf89df3706d10631e090fa364fcbb28b84f7ef6fd419a72dbe3c50ec9cdcf1b\nCopying blob sha256:57c14dd66db0390dbf6da578421c077f6de8e88edd0815b4caa94607ba5f4c09\nCopying config sha256:ef0b9da9b21de4aec1217f962bdecf73ddb7c4d3d007656df193e1d287096da8\nWriting manifest to image destination\nStoring signatures\nGenerating dockerfile with builder image docker.io/openshift/test-build-simples2i:latest\nSTEP 1: FROM docker.io/openshift/test-build-simples2i:latest\nSTEP 2: LABEL "io.openshift.build.image"="docker.io/openshift/test-build-simples2i:latest"       "io.openshift.build.source-location"="/tmp/build/inputs"\nSTEP 3: ENV OPENSHIFT_BUILD_NAME="statusfail-assemblescript-1"     OPENSHIFT_BUILD_NAMESPACE="e2e-test-update-buildstatus-669hm"\nSTEP 4: USER root\nSTEP 5: COPY upload/scripts /tmp/scripts\nSTEP 6: COPY upload/src /tmp/src\nSTEP 7: RUN chown -R 1001:0 /tmp/scripts /tmp/src\nSTEP 8: USER 1001\nSTEP 9: RUN /tmp/scripts/assemble\n/bin/sh: /tmp/scripts/assemble: not found\nsubprocess exited with status 127\nsubprocess exited with status 127\nerror: build error: error building at STEP "RUN /tmp/scripts/assemble": exit status 127\n
Jun 26 16:42:59.287 E ns/e2e-test-update-buildstatus-w5kj4 pod/statusfail-pushtoregistry-1-build node/ip-10-0-213-89.ec2.internal container/sti-build init container exited with code 255 (Error): :42:42.909093       1 sti.go:412] Locating docker auth for image bogus.registry/image and type PUSH_DOCKERCFG_PATH\nI0626 16:42:42.909108       1 cfg.go:68] Locating docker config paths for type PUSH_DOCKERCFG_PATH\nI0626 16:42:42.909124       1 cfg.go:68] Getting docker config in paths : [/var/run/secrets/openshift.io/push]\nI0626 16:42:42.909138       1 config.go:137] looking for config.json at /var/run/secrets/openshift.io/push/config.json\nI0626 16:42:42.909187       1 config.go:107] looking for .dockercfg at /var/run/secrets/openshift.io/push/.dockercfg\nI0626 16:42:42.909455       1 config.go:118] found .dockercfg at /var/run/secrets/openshift.io/push/.dockercfg\nI0626 16:42:42.909516       1 builder.go:332] No push secret provided\n\nPushing image bogus.registry/image ...\nPushing image "bogus.registry/image" from local storage.\nNo authentication secret provided for pushing to registry.\nGetting image source signatures\nSuccessfully pushed bogus.registry/image\nWarning: Push failed, retrying in 5s ...\nPushing image "bogus.registry/image" from local storage.\nNo authentication secret provided for pushing to registry.\nGetting image source signatures\nSuccessfully pushed bogus.registry/image\nWarning: Push failed, retrying in 5s ...\nPushing image "bogus.registry/image" from local storage.\nNo authentication secret provided for pushing to registry.\nGetting image source signatures\nSuccessfully pushed bogus.registry/image\nWarning: Push failed, retrying in 5s ...\nF0626 16:42:58.124107       1 helpers.go:115] error: build error: Failed to push image: error copying layers and metadata from "containers-storage:[overlay@/var/lib/containers/storage+/var/run/containers/storage:overlay.imagestore=/var/lib/shared]bogus.registry/image:latest" to "docker://bogus.registry/image:latest": Error trying to reuse blob sha256:57c14dd66db0390dbf6da578421c077f6de8e88edd0815b4caa94607ba5f4c09 at destination: error pinging docker registry bogus.registry: Get https://bogus.registry/v2/: dial tcp: lookup bogus.registry on 172.30.0.10:53: no such host\n
Jun 26 16:42:59.287 E ns/e2e-test-update-buildstatus-w5kj4 pod/statusfail-pushtoregistry-1-build node/ip-10-0-213-89.ec2.internal reason/Failed (): 
Jun 26 16:42:59.287 E ns/e2e-test-update-buildstatus-w5kj4 pod/statusfail-pushtoregistry-1-build node/ip-10-0-213-89.ec2.internal container/sti-build container exited with code 255 (Error): :42:42.909093       1 sti.go:412] Locating docker auth for image bogus.registry/image and type PUSH_DOCKERCFG_PATH\nI0626 16:42:42.909108       1 cfg.go:68] Locating docker config paths for type PUSH_DOCKERCFG_PATH\nI0626 16:42:42.909124       1 cfg.go:68] Getting docker config in paths : [/var/run/secrets/openshift.io/push]\nI0626 16:42:42.909138       1 config.go:137] looking for config.json at /var/run/secrets/openshift.io/push/config.json\nI0626 16:42:42.909187       1 config.go:107] looking for .dockercfg at /var/run/secrets/openshift.io/push/.dockercfg\nI0626 16:42:42.909455       1 config.go:118] found .dockercfg at /var/run/secrets/openshift.io/push/.dockercfg\nI0626 16:42:42.909516       1 builder.go:332] No push secret provided\n\nPushing image bogus.registry/image ...\nPushing image "bogus.registry/image" from local storage.\nNo authentication secret provided for pushing to registry.\nGetting image source signatures\nSuccessfully pushed bogus.registry/image\nWarning: Push failed, retrying in 5s ...\nPushing image "bogus.registry/image" from local storage.\nNo authentication secret provided for pushing to registry.\nGetting image source signatures\nSuccessfully pushed bogus.registry/image\nWarning: Push failed, retrying in 5s ...\nPushing image "bogus.registry/image" from local storage.\nNo authentication secret provided for pushing to registry.\nGetting image source signatures\nSuccessfully pushed bogus.registry/image\nWarning: Push failed, retrying in 5s ...\nF0626 16:42:58.124107       1 helpers.go:115] error: build error: Failed to push image: error copying layers and metadata from "containers-storage:[overlay@/var/lib/containers/storage+/var/run/containers/storage:overlay.imagestore=/var/lib/shared]bogus.registry/image:latest" to "docker://bogus.registry/image:latest": Error trying to reuse blob sha256:57c14dd66db0390dbf6da578421c077f6de8e88edd0815b4caa94607ba5f4c09 at destination: error pinging docker registry bogus.registry: Get https://bogus.registry/v2/: dial tcp: lookup bogus.registry on 172.30.0.10:53: no such host\n
Jun 26 16:46:05.043 E ns/openshift-controller-manager pod/controller-manager-ft8vn node/ip-10-0-209-29.ec2.internal container/controller-manager container exited with code 137 (Error): I0626 16:06:37.794349       1 controller_manager.go:39] Starting controllers on 0.0.0.0:8443 (554623c)\nI0626 16:06:37.796428       1 controller_manager.go:50] DeploymentConfig controller using images from "registry.svc.ci.openshift.org/ci-op-wqmhr5cq/stable@sha256:c7c497a2f52c76a72896874c6eca9ddf3201601f899c8eac5284d9dfb927876d"\nI0626 16:06:37.796508       1 controller_manager.go:56] Build controller using images from "registry.svc.ci.openshift.org/ci-op-wqmhr5cq/stable@sha256:c42af9ec377d244a33bff05ffa557757ad1cf68b5ee29b3cde8d6084095b1d25"\nI0626 16:06:37.796616       1 standalone_apiserver.go:98] Started health checks at 0.0.0.0:8443\nI0626 16:06:37.797908       1 leaderelection.go:242] attempting to acquire leader lease  openshift-controller-manager/openshift-master-controllers...\n
Jun 26 16:57:45.345 E ns/openshift-controller-manager pod/controller-manager-8fk5t node/ip-10-0-188-231.ec2.internal container/controller-manager container exited with code 137 (Error): .738205       1 reflector.go:175] Starting reflector *v1.ImageStream (10m0s) from runtime/asm_amd64.s:1357\nI0626 16:47:18.738538       1 reflector.go:175] Starting reflector *v1.TemplateInstance (10m0s) from runtime/asm_amd64.s:1357\nI0626 16:47:18.739952       1 reflector.go:175] Starting reflector *v1.ConfigMap (10m0s) from runtime/asm_amd64.s:1357\nI0626 16:47:18.770991       1 factory.go:85] deploymentconfig controller caches are synced. Starting workers.\nI0626 16:47:18.811232       1 templateinstance_finalizer.go:194] Starting TemplateInstanceFinalizer controller\nI0626 16:47:18.830775       1 templateinstance_controller.go:297] Starting TemplateInstance controller\nI0626 16:47:18.842459       1 buildconfig_controller.go:201] Starting buildconfig controller\nI0626 16:47:18.843699       1 shared_informer.go:230] Caches are synced for service account \nI0626 16:47:18.852371       1 shared_informer.go:230] Caches are synced for DefaultRoleBindingController \nI0626 16:47:18.938257       1 factory.go:80] Deployer controller caches are synced. Starting workers.\nI0626 16:47:19.096791       1 deleted_dockercfg_secrets.go:75] caches synced\nI0626 16:47:19.096799       1 deleted_token_secrets.go:70] caches synced\nI0626 16:47:19.097046       1 docker_registry_service.go:156] caches synced\nI0626 16:47:19.097099       1 create_dockercfg_secrets.go:219] urls found\nI0626 16:47:19.097112       1 create_dockercfg_secrets.go:225] caches synced\nI0626 16:47:19.097244       1 docker_registry_service.go:298] Updating registry URLs from map[172.30.169.4:5000:{} image-registry.openshift-image-registry.svc.cluster.local:5000:{} image-registry.openshift-image-registry.svc:5000:{}] to map[172.30.169.4:5000:{} image-registry.openshift-image-registry.svc.cluster.local:5000:{} image-registry.openshift-image-registry.svc:5000:{}]\nI0626 16:47:19.167245       1 build_controller.go:475] Starting build controller\nI0626 16:47:19.167266       1 build_controller.go:477] OpenShift image registry hostname: image-registry.openshift-image-registry.svc:5000\n
Jun 26 16:57:45.372 E ns/openshift-controller-manager pod/controller-manager-dtvrv node/ip-10-0-209-29.ec2.internal container/controller-manager container exited with code 137 (Error): I0626 16:46:16.925676       1 controller_manager.go:39] Starting controllers on 0.0.0.0:8443 (554623c)\nI0626 16:46:16.927333       1 controller_manager.go:50] DeploymentConfig controller using images from "registry.svc.ci.openshift.org/ci-op-wqmhr5cq/stable@sha256:c7c497a2f52c76a72896874c6eca9ddf3201601f899c8eac5284d9dfb927876d"\nI0626 16:46:16.927416       1 controller_manager.go:56] Build controller using images from "registry.svc.ci.openshift.org/ci-op-wqmhr5cq/stable@sha256:c42af9ec377d244a33bff05ffa557757ad1cf68b5ee29b3cde8d6084095b1d25"\nI0626 16:46:16.927380       1 standalone_apiserver.go:98] Started health checks at 0.0.0.0:8443\nI0626 16:46:16.927627       1 leaderelection.go:242] attempting to acquire leader lease  openshift-controller-manager/openshift-master-controllers...\n
Jun 26 17:00:04.872 E ns/openshift-controller-manager pod/controller-manager-ml6vk node/ip-10-0-188-231.ec2.internal container/controller-manager container exited with code 137 (Error): :1357\nI0626 16:59:00.931532       1 reflector.go:175] Starting reflector *v1.Route (10m0s) from runtime/asm_amd64.s:1357\nI0626 16:59:00.931748       1 reflector.go:175] Starting reflector *v1.Secret (10m0s) from runtime/asm_amd64.s:1357\nI0626 16:59:00.929269       1 reflector.go:175] Starting reflector *v1.Image (10m0s) from runtime/asm_amd64.s:1357\nI0626 16:59:01.006587       1 templateinstance_finalizer.go:194] Starting TemplateInstanceFinalizer controller\nI0626 16:59:01.029856       1 shared_informer.go:230] Caches are synced for DefaultRoleBindingController \nI0626 16:59:01.032198       1 shared_informer.go:230] Caches are synced for service account \nI0626 16:59:01.043383       1 factory.go:85] deploymentconfig controller caches are synced. Starting workers.\nI0626 16:59:01.050838       1 buildconfig_controller.go:201] Starting buildconfig controller\nI0626 16:59:01.061520       1 templateinstance_controller.go:297] Starting TemplateInstance controller\nI0626 16:59:01.079281       1 factory.go:80] Deployer controller caches are synced. Starting workers.\nI0626 16:59:01.283436       1 build_controller.go:475] Starting build controller\nI0626 16:59:01.283462       1 build_controller.go:477] OpenShift image registry hostname: image-registry.openshift-image-registry.svc:5000\nI0626 16:59:01.305421       1 deleted_dockercfg_secrets.go:75] caches synced\nI0626 16:59:01.305727       1 docker_registry_service.go:156] caches synced\nI0626 16:59:01.305748       1 create_dockercfg_secrets.go:219] urls found\nI0626 16:59:01.305765       1 create_dockercfg_secrets.go:225] caches synced\nI0626 16:59:01.305830       1 docker_registry_service.go:298] Updating registry URLs from map[172.30.169.4:5000:{} image-registry.openshift-image-registry.svc.cluster.local:5000:{} image-registry.openshift-image-registry.svc:5000:{}] to map[172.30.169.4:5000:{} image-registry.openshift-image-registry.svc.cluster.local:5000:{} image-registry.openshift-image-registry.svc:5000:{}]\nI0626 16:59:01.306586       1 deleted_token_secrets.go:70] caches synced\n
Jun 26 17:02:05.287 E ns/openshift-controller-manager pod/controller-manager-hng4s node/ip-10-0-209-29.ec2.internal container/controller-manager container exited with code 137 (Error): I0626 17:00:17.869745       1 controller_manager.go:39] Starting controllers on 0.0.0.0:8443 (554623c)\nI0626 17:00:17.871347       1 controller_manager.go:50] DeploymentConfig controller using images from "registry.svc.ci.openshift.org/ci-op-wqmhr5cq/stable@sha256:c7c497a2f52c76a72896874c6eca9ddf3201601f899c8eac5284d9dfb927876d"\nI0626 17:00:17.871370       1 controller_manager.go:56] Build controller using images from "registry.svc.ci.openshift.org/ci-op-wqmhr5cq/stable@sha256:c42af9ec377d244a33bff05ffa557757ad1cf68b5ee29b3cde8d6084095b1d25"\nI0626 17:00:17.871484       1 standalone_apiserver.go:98] Started health checks at 0.0.0.0:8443\nI0626 17:00:17.871491       1 leaderelection.go:242] attempting to acquire leader lease  openshift-controller-manager/openshift-master-controllers...\n
Jun 26 17:02:05.374 E ns/openshift-controller-manager pod/controller-manager-qpwdg node/ip-10-0-188-231.ec2.internal container/controller-manager container exited with code 137 (Error): I0626 17:00:15.507768       1 controller_manager.go:39] Starting controllers on 0.0.0.0:8443 (554623c)\nI0626 17:00:15.509482       1 controller_manager.go:50] DeploymentConfig controller using images from "registry.svc.ci.openshift.org/ci-op-wqmhr5cq/stable@sha256:c7c497a2f52c76a72896874c6eca9ddf3201601f899c8eac5284d9dfb927876d"\nI0626 17:00:15.509507       1 controller_manager.go:56] Build controller using images from "registry.svc.ci.openshift.org/ci-op-wqmhr5cq/stable@sha256:c42af9ec377d244a33bff05ffa557757ad1cf68b5ee29b3cde8d6084095b1d25"\nI0626 17:00:15.509592       1 standalone_apiserver.go:98] Started health checks at 0.0.0.0:8443\nI0626 17:00:15.509721       1 leaderelection.go:242] attempting to acquire leader lease  openshift-controller-manager/openshift-master-controllers...\n
Jun 26 17:03:54.592 E ns/e2e-test-build-cluster-config-9xqnk pod/simple-s2i-build-1-build node/ip-10-0-137-182.ec2.internal container/git-clone container exited with code 1 (Error): Cloning "https://github.com/sclorg/nodejs-ex" ...\nerror: fatal: unable to access 'https://github.com/sclorg/nodejs-ex/': Could not resolve proxy: invalid.proxy.redhat.com; Unknown error\n
Jun 26 17:03:54.592 E ns/e2e-test-build-cluster-config-9xqnk pod/simple-s2i-build-1-build node/ip-10-0-137-182.ec2.internal reason/Failed (): 
Jun 26 17:03:54.592 E ns/e2e-test-build-cluster-config-9xqnk pod/simple-s2i-build-1-build node/ip-10-0-137-182.ec2.internal container/git-clone init container exited with code 1 (Error): Cloning "https://github.com/sclorg/nodejs-ex" ...\nerror: fatal: unable to access 'https://github.com/sclorg/nodejs-ex/': Could not resolve proxy: invalid.proxy.redhat.com; Unknown error\n
Jun 26 17:05:04.902 E ns/openshift-controller-manager pod/controller-manager-d6ggx node/ip-10-0-209-29.ec2.internal container/controller-manager container exited with code 137 (Error): I0626 17:02:17.000396       1 controller_manager.go:39] Starting controllers on 0.0.0.0:8443 (554623c)\nI0626 17:02:17.002044       1 controller_manager.go:50] DeploymentConfig controller using images from "registry.svc.ci.openshift.org/ci-op-wqmhr5cq/stable@sha256:c7c497a2f52c76a72896874c6eca9ddf3201601f899c8eac5284d9dfb927876d"\nI0626 17:02:17.002074       1 controller_manager.go:56] Build controller using images from "registry.svc.ci.openshift.org/ci-op-wqmhr5cq/stable@sha256:c42af9ec377d244a33bff05ffa557757ad1cf68b5ee29b3cde8d6084095b1d25"\nI0626 17:02:17.002160       1 standalone_apiserver.go:98] Started health checks at 0.0.0.0:8443\nI0626 17:02:17.002303       1 leaderelection.go:242] attempting to acquire leader lease  openshift-controller-manager/openshift-master-controllers...\n
Jun 26 17:05:05.182 E ns/openshift-controller-manager pod/controller-manager-jdvs8 node/ip-10-0-189-33.ec2.internal container/controller-manager container exited with code 137 (Error): I0626 17:02:08.818792       1 controller_manager.go:39] Starting controllers on 0.0.0.0:8443 (554623c)\nI0626 17:02:08.820171       1 controller_manager.go:50] DeploymentConfig controller using images from "registry.svc.ci.openshift.org/ci-op-wqmhr5cq/stable@sha256:c7c497a2f52c76a72896874c6eca9ddf3201601f899c8eac5284d9dfb927876d"\nI0626 17:02:08.820191       1 controller_manager.go:56] Build controller using images from "registry.svc.ci.openshift.org/ci-op-wqmhr5cq/stable@sha256:c42af9ec377d244a33bff05ffa557757ad1cf68b5ee29b3cde8d6084095b1d25"\nI0626 17:02:08.820341       1 leaderelection.go:242] attempting to acquire leader lease  openshift-controller-manager/openshift-master-controllers...\nI0626 17:02:08.820400       1 standalone_apiserver.go:98] Started health checks at 0.0.0.0:8443\n
Jun 26 17:07:05.340 E ns/openshift-controller-manager pod/controller-manager-zwq7s node/ip-10-0-209-29.ec2.internal container/controller-manager container exited with code 137 (Error): I0626 17:05:17.838406       1 controller_manager.go:39] Starting controllers on 0.0.0.0:8443 (554623c)\nI0626 17:05:17.840362       1 controller_manager.go:50] DeploymentConfig controller using images from "registry.svc.ci.openshift.org/ci-op-wqmhr5cq/stable@sha256:c7c497a2f52c76a72896874c6eca9ddf3201601f899c8eac5284d9dfb927876d"\nI0626 17:05:17.840387       1 controller_manager.go:56] Build controller using images from "registry.svc.ci.openshift.org/ci-op-wqmhr5cq/stable@sha256:c42af9ec377d244a33bff05ffa557757ad1cf68b5ee29b3cde8d6084095b1d25"\nI0626 17:05:17.840491       1 standalone_apiserver.go:98] Started health checks at 0.0.0.0:8443\nI0626 17:05:17.840570       1 leaderelection.go:242] attempting to acquire leader lease  openshift-controller-manager/openshift-master-controllers...\n
Jun 26 17:09:16.553 E ns/e2e-test-build-cluster-config-hnk2r pod/simple-s2i-build-1-build node/ip-10-0-137-182.ec2.internal container/git-clone container exited with code 1 (Error): Cloning "https://github.com/sclorg/nodejs-ex" ...\nerror: Unable to update build status: Get https://172.30.0.1:443/apis/build.openshift.io/v1/namespaces/e2e-test-build-cluster-config-hnk2r/builds/simple-s2i-build-1: proxyconnect tcp: dial tcp: lookup invalid.proxy.redhat.com on 172.30.0.10:53: no such host\nerror: fatal: unable to access 'https://github.com/sclorg/nodejs-ex/': Could not resolve proxy: invalid.proxy.redhat.com; Unknown error\n
Jun 26 17:09:16.553 E ns/e2e-test-build-cluster-config-hnk2r pod/simple-s2i-build-1-build node/ip-10-0-137-182.ec2.internal reason/Failed (): 
Jun 26 17:09:16.553 E ns/e2e-test-build-cluster-config-hnk2r pod/simple-s2i-build-1-build node/ip-10-0-137-182.ec2.internal container/git-clone init container exited with code 1 (Error): Cloning "https://github.com/sclorg/nodejs-ex" ...\nerror: Unable to update build status: Get https://172.30.0.1:443/apis/build.openshift.io/v1/namespaces/e2e-test-build-cluster-config-hnk2r/builds/simple-s2i-build-1: proxyconnect tcp: dial tcp: lookup invalid.proxy.redhat.com on 172.30.0.10:53: no such host\nerror: fatal: unable to access 'https://github.com/sclorg/nodejs-ex/': Could not resolve proxy: invalid.proxy.redhat.com; Unknown error\n
Jun 26 17:10:45.070 E ns/openshift-controller-manager pod/controller-manager-chtwp node/ip-10-0-209-29.ec2.internal container/controller-manager container exited with code 137 (Error): I0626 17:07:17.682211       1 controller_manager.go:39] Starting controllers on 0.0.0.0:8443 (554623c)\nI0626 17:07:17.683852       1 controller_manager.go:50] DeploymentConfig controller using images from "registry.svc.ci.openshift.org/ci-op-wqmhr5cq/stable@sha256:c7c497a2f52c76a72896874c6eca9ddf3201601f899c8eac5284d9dfb927876d"\nI0626 17:07:17.683920       1 controller_manager.go:56] Build controller using images from "registry.svc.ci.openshift.org/ci-op-wqmhr5cq/stable@sha256:c42af9ec377d244a33bff05ffa557757ad1cf68b5ee29b3cde8d6084095b1d25"\nI0626 17:07:17.683994       1 standalone_apiserver.go:98] Started health checks at 0.0.0.0:8443\nI0626 17:07:17.684060       1 leaderelection.go:242] attempting to acquire leader lease  openshift-controller-manager/openshift-master-controllers...\n
Jun 26 17:10:45.350 E ns/openshift-controller-manager pod/controller-manager-nlzrb node/ip-10-0-188-231.ec2.internal container/controller-manager container exited with code 137 (Error): I0626 17:07:16.020217       1 controller_manager.go:39] Starting controllers on 0.0.0.0:8443 (554623c)\nI0626 17:07:16.021704       1 controller_manager.go:50] DeploymentConfig controller using images from "registry.svc.ci.openshift.org/ci-op-wqmhr5cq/stable@sha256:c7c497a2f52c76a72896874c6eca9ddf3201601f899c8eac5284d9dfb927876d"\nI0626 17:07:16.021724       1 controller_manager.go:56] Build controller using images from "registry.svc.ci.openshift.org/ci-op-wqmhr5cq/stable@sha256:c42af9ec377d244a33bff05ffa557757ad1cf68b5ee29b3cde8d6084095b1d25"\nI0626 17:07:16.021793       1 standalone_apiserver.go:98] Started health checks at 0.0.0.0:8443\nI0626 17:07:16.021901       1 leaderelection.go:242] attempting to acquire leader lease  openshift-controller-manager/openshift-master-controllers...\n
Jun 26 17:14:40.544 E ns/e2e-test-build-cluster-config-f4hxv pod/verbose-s2i-build-1-build node/ip-10-0-137-182.ec2.internal container/git-clone container exited with code 255 (Error): ype\":\"New\"}":{".":{},"f:lastTransitionTime":{},"f:lastUpdateTime":{},"f:status":{},"f:type":{}}},"f:config":{".":{},"f:kind":{},"f:name":{},"f:namespace":{}},"f:phase":{}}}}]},"spec":{"serviceAccount":"builder","source":{"type":"Git","git":{"uri":"https://github.com/sclorg/nodejs-ex","httpProxy":"http://invalid.proxy.redhat.com:3288","httpsProxy":"http://invalid.proxy.redhat.com:3288","noProxy":"image-registry.openshift-image-registry.svc:5000"}},"strategy":{"type":"Source","sourceStrategy":{"from":{"kind":"DockerImage","name":"docker.io/openshift/test-build-simples2i:latest"},"pullSecret":{"name":"builder-dockercfg-vnhkg"},"env":[{"name":"BUILD_LOGLEVEL","value":"5"}]}},"output":{},"resources":{},"postCommit":{},"nodeSelector":null,"triggeredBy":[{"message":"Manually triggered"}]},"status":{"phase":"New","config":{"kind":"BuildConfig","namespace":"e2e-test-build-cluster-config-f4hxv","name":"verbose-s2i-build"},"output":{},"conditions":[{"type":"New","status":"True","lastUpdateTime":"2020-06-26T17:14:23Z","lastTransitionTime":"2020-06-26T17:14:23Z"}]}}\nCloning "https://github.com/sclorg/nodejs-ex" ...\nI0626 17:14:26.301958       1 source.go:237] git ls-remote --heads https://github.com/sclorg/nodejs-ex\nI0626 17:14:26.301979       1 repository.go:424] Executing git ls-remote --heads https://github.com/sclorg/nodejs-ex\nI0626 17:14:26.421063       1 repository.go:492] Error executing command: exit status 128\nI0626 17:14:26.421142       1 source.go:237] fatal: unable to access 'https://github.com/sclorg/nodejs-ex/': Could not resolve proxy: invalid.proxy.redhat.com; Unknown error\nerror: Unable to update build status: Get https://172.30.0.1:443/apis/build.openshift.io/v1/namespaces/e2e-test-build-cluster-config-f4hxv/builds/verbose-s2i-build-1: proxyconnect tcp: dial tcp: lookup invalid.proxy.redhat.com on 172.30.0.10:53: no such host\nF0626 17:14:40.105597       1 helpers.go:115] error: fatal: unable to access 'https://github.com/sclorg/nodejs-ex/': Could not resolve proxy: invalid.proxy.redhat.com; Unknown error\n
Jun 26 17:14:40.544 E ns/e2e-test-build-cluster-config-f4hxv pod/verbose-s2i-build-1-build node/ip-10-0-137-182.ec2.internal reason/Failed (): 
Jun 26 17:14:40.544 E ns/e2e-test-build-cluster-config-f4hxv pod/verbose-s2i-build-1-build node/ip-10-0-137-182.ec2.internal container/git-clone init container exited with code 255 (Error): ype\":\"New\"}":{".":{},"f:lastTransitionTime":{},"f:lastUpdateTime":{},"f:status":{},"f:type":{}}},"f:config":{".":{},"f:kind":{},"f:name":{},"f:namespace":{}},"f:phase":{}}}}]},"spec":{"serviceAccount":"builder","source":{"type":"Git","git":{"uri":"https://github.com/sclorg/nodejs-ex","httpProxy":"http://invalid.proxy.redhat.com:3288","httpsProxy":"http://invalid.proxy.redhat.com:3288","noProxy":"image-registry.openshift-image-registry.svc:5000"}},"strategy":{"type":"Source","sourceStrategy":{"from":{"kind":"DockerImage","name":"docker.io/openshift/test-build-simples2i:latest"},"pullSecret":{"name":"builder-dockercfg-vnhkg"},"env":[{"name":"BUILD_LOGLEVEL","value":"5"}]}},"output":{},"resources":{},"postCommit":{},"nodeSelector":null,"triggeredBy":[{"message":"Manually triggered"}]},"status":{"phase":"New","config":{"kind":"BuildConfig","namespace":"e2e-test-build-cluster-config-f4hxv","name":"verbose-s2i-build"},"output":{},"conditions":[{"type":"New","status":"True","lastUpdateTime":"2020-06-26T17:14:23Z","lastTransitionTime":"2020-06-26T17:14:23Z"}]}}\nCloning "https://github.com/sclorg/nodejs-ex" ...\nI0626 17:14:26.301958       1 source.go:237] git ls-remote --heads https://github.com/sclorg/nodejs-ex\nI0626 17:14:26.301979       1 repository.go:424] Executing git ls-remote --heads https://github.com/sclorg/nodejs-ex\nI0626 17:14:26.421063       1 repository.go:492] Error executing command: exit status 128\nI0626 17:14:26.421142       1 source.go:237] fatal: unable to access 'https://github.com/sclorg/nodejs-ex/': Could not resolve proxy: invalid.proxy.redhat.com; Unknown error\nerror: Unable to update build status: Get https://172.30.0.1:443/apis/build.openshift.io/v1/namespaces/e2e-test-build-cluster-config-f4hxv/builds/verbose-s2i-build-1: proxyconnect tcp: dial tcp: lookup invalid.proxy.redhat.com on 172.30.0.10:53: no such host\nF0626 17:14:40.105597       1 helpers.go:115] error: fatal: unable to access 'https://github.com/sclorg/nodejs-ex/': Could not resolve proxy: invalid.proxy.redhat.com; Unknown error\n
Jun 26 17:15:45.080 E ns/openshift-controller-manager pod/controller-manager-bf46b node/ip-10-0-209-29.ec2.internal container/controller-manager container exited with code 137 (Error): I0626 17:12:57.063371       1 controller_manager.go:39] Starting controllers on 0.0.0.0:8443 (554623c)\nI0626 17:12:57.066520       1 controller_manager.go:50] DeploymentConfig controller using images from "registry.svc.ci.openshift.org/ci-op-wqmhr5cq/stable@sha256:c7c497a2f52c76a72896874c6eca9ddf3201601f899c8eac5284d9dfb927876d"\nI0626 17:12:57.066553       1 controller_manager.go:56] Build controller using images from "registry.svc.ci.openshift.org/ci-op-wqmhr5cq/stable@sha256:c42af9ec377d244a33bff05ffa557757ad1cf68b5ee29b3cde8d6084095b1d25"\nI0626 17:12:57.066659       1 standalone_apiserver.go:98] Started health checks at 0.0.0.0:8443\nI0626 17:12:57.066744       1 leaderelection.go:242] attempting to acquire leader lease  openshift-controller-manager/openshift-master-controllers...\n
Jun 26 17:15:45.456 E ns/openshift-controller-manager pod/controller-manager-z7n2v node/ip-10-0-188-231.ec2.internal container/controller-manager container exited with code 137 (Error): I0626 17:12:55.822786       1 controller_manager.go:39] Starting controllers on 0.0.0.0:8443 (554623c)\nI0626 17:12:55.824300       1 controller_manager.go:50] DeploymentConfig controller using images from "registry.svc.ci.openshift.org/ci-op-wqmhr5cq/stable@sha256:c7c497a2f52c76a72896874c6eca9ddf3201601f899c8eac5284d9dfb927876d"\nI0626 17:12:55.824326       1 controller_manager.go:56] Build controller using images from "registry.svc.ci.openshift.org/ci-op-wqmhr5cq/stable@sha256:c42af9ec377d244a33bff05ffa557757ad1cf68b5ee29b3cde8d6084095b1d25"\nI0626 17:12:55.824425       1 standalone_apiserver.go:98] Started health checks at 0.0.0.0:8443\nI0626 17:12:55.824823       1 leaderelection.go:242] attempting to acquire leader lease  openshift-controller-manager/openshift-master-controllers...\n
Jun 26 17:18:04.973 E ns/openshift-controller-manager pod/controller-manager-lw64s node/ip-10-0-188-231.ec2.internal container/controller-manager container exited with code 137 (Error): I0626 17:15:55.571054       1 controller_manager.go:39] Starting controllers on 0.0.0.0:8443 (554623c)\nI0626 17:15:55.573541       1 controller_manager.go:50] DeploymentConfig controller using images from "registry.svc.ci.openshift.org/ci-op-wqmhr5cq/stable@sha256:c7c497a2f52c76a72896874c6eca9ddf3201601f899c8eac5284d9dfb927876d"\nI0626 17:15:55.573626       1 controller_manager.go:56] Build controller using images from "registry.svc.ci.openshift.org/ci-op-wqmhr5cq/stable@sha256:c42af9ec377d244a33bff05ffa557757ad1cf68b5ee29b3cde8d6084095b1d25"\nI0626 17:15:55.573857       1 standalone_apiserver.go:98] Started health checks at 0.0.0.0:8443\nI0626 17:15:55.574601       1 leaderelection.go:242] attempting to acquire leader lease  openshift-controller-manager/openshift-master-controllers...\n
Jun 26 17:18:05.153 E ns/openshift-controller-manager pod/controller-manager-dhvdd node/ip-10-0-189-33.ec2.internal container/controller-manager container exited with code 137 (Error):  17:17:00.917151       1 reflector.go:175] Starting reflector *v1.Event (2h0m0s) from runtime/asm_amd64.s:1357\nI0626 17:17:00.920440       1 reflector.go:175] Starting reflector *v1.TemplateInstance (10m0s) from runtime/asm_amd64.s:1357\nI0626 17:17:00.920515       1 reflector.go:175] Starting reflector *v1.Route (10m0s) from runtime/asm_amd64.s:1357\nI0626 17:17:00.950884       1 buildconfig_controller.go:201] Starting buildconfig controller\nI0626 17:17:00.963488       1 factory.go:85] deploymentconfig controller caches are synced. Starting workers.\nI0626 17:17:01.004494       1 shared_informer.go:230] Caches are synced for service account \nI0626 17:17:01.024473       1 shared_informer.go:230] Caches are synced for DefaultRoleBindingController \nI0626 17:17:01.045702       1 templateinstance_controller.go:297] Starting TemplateInstance controller\nI0626 17:17:01.067461       1 templateinstance_finalizer.go:194] Starting TemplateInstanceFinalizer controller\nI0626 17:17:01.155539       1 factory.go:80] Deployer controller caches are synced. Starting workers.\nI0626 17:17:01.326105       1 deleted_dockercfg_secrets.go:75] caches synced\nI0626 17:17:01.326143       1 deleted_token_secrets.go:70] caches synced\nI0626 17:17:01.326456       1 docker_registry_service.go:156] caches synced\nI0626 17:17:01.326517       1 create_dockercfg_secrets.go:219] urls found\nI0626 17:17:01.326535       1 create_dockercfg_secrets.go:225] caches synced\nI0626 17:17:01.326648       1 docker_registry_service.go:298] Updating registry URLs from map[172.30.169.4:5000:{} image-registry.openshift-image-registry.svc.cluster.local:5000:{} image-registry.openshift-image-registry.svc:5000:{}] to map[172.30.169.4:5000:{} image-registry.openshift-image-registry.svc.cluster.local:5000:{} image-registry.openshift-image-registry.svc:5000:{}]\nI0626 17:17:01.340533       1 build_controller.go:475] Starting build controller\nI0626 17:17:01.340558       1 build_controller.go:477] OpenShift image registry hostname: image-registry.openshift-image-registry.svc:5000\n
Jun 26 17:20:25.026 E ns/openshift-controller-manager pod/controller-manager-9dqv2 node/ip-10-0-209-29.ec2.internal container/controller-manager container exited with code 137 (Error): I0626 17:18:17.046920       1 controller_manager.go:39] Starting controllers on 0.0.0.0:8443 (554623c)\nI0626 17:18:17.048330       1 controller_manager.go:50] DeploymentConfig controller using images from "registry.svc.ci.openshift.org/ci-op-wqmhr5cq/stable@sha256:c7c497a2f52c76a72896874c6eca9ddf3201601f899c8eac5284d9dfb927876d"\nI0626 17:18:17.048350       1 controller_manager.go:56] Build controller using images from "registry.svc.ci.openshift.org/ci-op-wqmhr5cq/stable@sha256:c42af9ec377d244a33bff05ffa557757ad1cf68b5ee29b3cde8d6084095b1d25"\nI0626 17:18:17.048423       1 standalone_apiserver.go:98] Started health checks at 0.0.0.0:8443\nI0626 17:18:17.048546       1 leaderelection.go:242] attempting to acquire leader lease  openshift-controller-manager/openshift-master-controllers...\n
Jun 26 17:22:24.953 E ns/openshift-controller-manager pod/controller-manager-29spx node/ip-10-0-188-231.ec2.internal container/controller-manager container exited with code 137 (Error): I0626 17:20:35.439631       1 controller_manager.go:39] Starting controllers on 0.0.0.0:8443 (554623c)\nI0626 17:20:35.441438       1 controller_manager.go:50] DeploymentConfig controller using images from "registry.svc.ci.openshift.org/ci-op-wqmhr5cq/stable@sha256:c7c497a2f52c76a72896874c6eca9ddf3201601f899c8eac5284d9dfb927876d"\nI0626 17:20:35.441459       1 controller_manager.go:56] Build controller using images from "registry.svc.ci.openshift.org/ci-op-wqmhr5cq/stable@sha256:c42af9ec377d244a33bff05ffa557757ad1cf68b5ee29b3cde8d6084095b1d25"\nI0626 17:20:35.441575       1 standalone_apiserver.go:98] Started health checks at 0.0.0.0:8443\nI0626 17:20:35.441677       1 leaderelection.go:242] attempting to acquire leader lease  openshift-controller-manager/openshift-master-controllers...\n
Jun 26 17:22:25.239 E ns/openshift-controller-manager pod/controller-manager-h242r node/ip-10-0-189-33.ec2.internal container/controller-manager container exited with code 137 (Error): 1:31.418173       1 reflector.go:175] Starting reflector *v1.ImageStream (10m0s) from runtime/asm_amd64.s:1357\nI0626 17:21:31.418244       1 reflector.go:175] Starting reflector *v1.Image (10m0s) from runtime/asm_amd64.s:1357\nI0626 17:21:31.418291       1 reflector.go:175] Starting reflector *v1.TemplateInstance (10m0s) from runtime/asm_amd64.s:1357\nI0626 17:21:31.473286       1 buildconfig_controller.go:201] Starting buildconfig controller\nI0626 17:21:31.494303       1 templateinstance_finalizer.go:194] Starting TemplateInstanceFinalizer controller\nI0626 17:21:31.510603       1 shared_informer.go:230] Caches are synced for service account \nI0626 17:21:31.516372       1 templateinstance_controller.go:297] Starting TemplateInstance controller\nI0626 17:21:31.516804       1 factory.go:85] deploymentconfig controller caches are synced. Starting workers.\nI0626 17:21:31.534887       1 shared_informer.go:230] Caches are synced for DefaultRoleBindingController \nI0626 17:21:31.552663       1 factory.go:80] Deployer controller caches are synced. Starting workers.\nI0626 17:21:31.726774       1 build_controller.go:475] Starting build controller\nI0626 17:21:31.726886       1 build_controller.go:477] OpenShift image registry hostname: image-registry.openshift-image-registry.svc:5000\nI0626 17:21:31.756700       1 deleted_token_secrets.go:70] caches synced\nI0626 17:21:31.756705       1 deleted_dockercfg_secrets.go:75] caches synced\nI0626 17:21:31.756870       1 docker_registry_service.go:156] caches synced\nI0626 17:21:31.756879       1 create_dockercfg_secrets.go:219] urls found\nI0626 17:21:31.756897       1 create_dockercfg_secrets.go:225] caches synced\nI0626 17:21:31.757605       1 docker_registry_service.go:298] Updating registry URLs from map[172.30.169.4:5000:{} image-registry.openshift-image-registry.svc.cluster.local:5000:{} image-registry.openshift-image-registry.svc:5000:{}] to map[172.30.169.4:5000:{} image-registry.openshift-image-registry.svc.cluster.local:5000:{} image-registry.openshift-image-registry.svc:5000:{}]\n

				
				Click to see stdout/stderrfrom junit_e2e_20200626-172319.xml

Find was mentions in log files


Show 139 Passed Tests

Show 10 Skipped Tests