ResultFAILURE
Tests 1 failed / 2 succeeded
Started2020-05-27 20:02
Elapsed59s
Work namespaceci-op-ztgyqdjp
Refs master:5c76c300
127:eca6eb71
podfae8f555-a054-11ea-923c-0a580a830287
repoopenshift/certman-operator
revision1

Test Failures


operator Run test coverage - container test 0.00s

go run hack/e2e.go -v -test --test_args='--ginkgo.focus=operator\sRun\stest\scoverage\s\-\scontainer\stest$'
cannot find package "sigs.k8s.io/controller-runtime/pkg/handler" in any of:
	/usr/local/go/src/sigs.k8s.io/controller-runtime/pkg/handler (from $GOROOT)
	/go/src/sigs.k8s.io/controller-runtime/pkg/handler (from $GOPATH)
pkg/controller/certificaterequest/certificaterequest_controller.go:33:2: cannot find package "sigs.k8s.io/controller-runtime/pkg/log" in any of:
	/usr/local/go/src/sigs.k8s.io/controller-runtime/pkg/log (from $GOROOT)
	/go/src/sigs.k8s.io/controller-runtime/pkg/log (from $GOPATH)
pkg/controller/certificaterequest/certificaterequest_controller.go:34:2: cannot find package "sigs.k8s.io/controller-runtime/pkg/manager" in any of:
	/usr/local/go/src/sigs.k8s.io/controller-runtime/pkg/manager (from $GOROOT)
	/go/src/sigs.k8s.io/controller-runtime/pkg/manager (from $GOPATH)
cmd/manager/main.go:26:2: cannot find package "sigs.k8s.io/controller-runtime/pkg/manager/signals" in any of:
	/usr/local/go/src/sigs.k8s.io/controller-runtime/pkg/manager/signals (from $GOROOT)
	/go/src/sigs.k8s.io/controller-runtime/pkg/manager/signals (from $GOPATH)
pkg/controller/certificaterequest/certificaterequest_controller.go:35:2: cannot find package "sigs.k8s.io/controller-runtime/pkg/reconcile" in any of:
	/usr/local/go/src/sigs.k8s.io/controller-runtime/pkg/reconcile (from $GOROOT)
	/go/src/sigs.k8s.io/controller-runtime/pkg/reconcile (from $GOPATH)
pkg/apis/certman/v1alpha1/register.go:10:2: cannot find package "sigs.k8s.io/controller-runtime/pkg/scheme" in any of:
	/usr/local/go/src/sigs.k8s.io/controller-runtime/pkg/scheme (from $GOROOT)
	/go/src/sigs.k8s.io/controller-runtime/pkg/scheme (from $GOPATH)
pkg/controller/certificaterequest/certificaterequest_controller.go:36:2: cannot find package "sigs.k8s.io/controller-runtime/pkg/source" in any of:
	/usr/local/go/src/sigs.k8s.io/controller-runtime/pkg/source (from $GOROOT)
	/go/src/sigs.k8s.io/controller-runtime/pkg/source (from $GOPATH)
make[1]: *** [gotest] Error 1
make[1]: Leaving directory `/go/src/github.com/openshift/certman-operator'
make: *** [coverage] Error 2

				from junit_operator.xml

Filter through log files


Show 2 Passed Tests

Error lines from build-log.txt

... skipping 203 lines ...