ResultFAILURE
Tests 1 failed / 2 succeeded
Started2020-05-24 21:23
Elapsed1m43s
Work namespaceci-op-x3lkgl5m
Refs master:0ea358a2
127:06952607
podc3134086-9e04-11ea-9945-0a580a8300dd
repoopenshift/certman-operator
revision1

Test Failures


operator Run test coverage - container test 0.00s

go run hack/e2e.go -v -test --test_args='--ginkgo.focus=operator\sRun\stest\scoverage\s\-\scontainer\stest$'
)
pkg/controller/certificaterequest/certificaterequest_controller.go:32:2: cannot find package "sigs.k8s.io/controller-runtime/pkg/handler" in any of:
	/usr/local/go/src/sigs.k8s.io/controller-runtime/pkg/handler (from $GOROOT)
	/go/src/sigs.k8s.io/controller-runtime/pkg/handler (from $GOPATH)
pkg/controller/certificaterequest/certificaterequest_controller.go:33:2: cannot find package "sigs.k8s.io/controller-runtime/pkg/log" in any of:
	/usr/local/go/src/sigs.k8s.io/controller-runtime/pkg/log (from $GOROOT)
	/go/src/sigs.k8s.io/controller-runtime/pkg/log (from $GOPATH)
pkg/controller/certificaterequest/certificaterequest_controller.go:34:2: cannot find package "sigs.k8s.io/controller-runtime/pkg/manager" in any of:
	/usr/local/go/src/sigs.k8s.io/controller-runtime/pkg/manager (from $GOROOT)
	/go/src/sigs.k8s.io/controller-runtime/pkg/manager (from $GOPATH)
cmd/manager/main.go:26:2: cannot find package "sigs.k8s.io/controller-runtime/pkg/manager/signals" in any of:
	/usr/local/go/src/sigs.k8s.io/controller-runtime/pkg/manager/signals (from $GOROOT)
	/go/src/sigs.k8s.io/controller-runtime/pkg/manager/signals (from $GOPATH)
pkg/controller/certificaterequest/certificaterequest_controller.go:35:2: cannot find package "sigs.k8s.io/controller-runtime/pkg/reconcile" in any of:
	/usr/local/go/src/sigs.k8s.io/controller-runtime/pkg/reconcile (from $GOROOT)
	/go/src/sigs.k8s.io/controller-runtime/pkg/reconcile (from $GOPATH)
pkg/apis/certman/v1alpha1/register.go:10:2: cannot find package "sigs.k8s.io/controller-runtime/pkg/scheme" in any of:
	/usr/local/go/src/sigs.k8s.io/controller-runtime/pkg/scheme (from $GOROOT)
	/go/src/sigs.k8s.io/controller-runtime/pkg/scheme (from $GOPATH)
pkg/controller/certificaterequest/certificaterequest_controller.go:36:2: cannot find package "sigs.k8s.io/controller-runtime/pkg/source" in any of:
	/usr/local/go/src/sigs.k8s.io/controller-runtime/pkg/source (from $GOROOT)
	/go/src/sigs.k8s.io/controller-runtime/pkg/source (from $GOPATH)
make[1]: *** [gotest] Error 1
make: *** [coverage] Error 2

				from junit_operator.xml

Filter through log files


Show 2 Passed Tests

Error lines from build-log.txt

... skipping 191 lines ...