ResultFAILURE
Tests 1 failed / 2 succeeded
Started2020-05-27 14:15
Elapsed2m39s
Work namespaceci-op-x5wpw83j
Refs master:0ea358a2
146:7eae19c3
pod847fa637-a024-11ea-8ce8-0a580a800436
repoopenshift/certman-operator
revision1

Test Failures


operator Run test coverage - container test 30s

go run hack/e2e.go -v -test --test_args='--ginkgo.focus=operator\sRun\stest\scoverage\s\-\scontainer\stest$'
hack/codecov.sh
make[1]: Entering directory `/go/src/github.com/openshift/certman-operator'
go test -coverprofile=coverage.out.tmp -covermode=atomic -coverpkg=./... ./...
# github.com/openshift/certman-operator/pkg/clients/azure
pkg/clients/azure/dns.go:149: no new variables on left side of :=
# github.com/openshift/certman-operator/pkg/clients/azure [github.com/openshift/certman-operator/pkg/clients/azure.test]
pkg/clients/azure/dns.go:149: no new variables on left side of :=
FAIL	github.com/openshift/certman-operator/pkg/clients/aws [build failed]
FAIL	github.com/openshift/certman-operator/pkg/clients/azure [build failed]
FAIL	github.com/openshift/certman-operator/pkg/controller/certificaterequest [build failed]
FAIL	github.com/openshift/certman-operator/pkg/controller/clusterdeployment [build failed]
FAIL	github.com/openshift/certman-operator/pkg/controller/utils [build failed]
FAIL	github.com/openshift/certman-operator/pkg/leclient [build failed]
make[1]: *** [gotest] Error 2
make[1]: Leaving directory `/go/src/github.com/openshift/certman-operator'
make: *** [coverage] Error 2

				from junit_operator.xml

Filter through log files


Show 2 Passed Tests

Error lines from build-log.txt

... skipping 58 lines ...