ResultFAILURE
Tests 4 failed / 912 succeeded
Started2020-03-25 17:57
Elapsed1h7m
Work namespaceci-op-9c8zp6tk
Refs master:24d4772d
458:2cfb0348
podf7557152-6ec1-11ea-aeec-0a58ac103b3a
repoopenshift/cluster-image-registry-operator
revision1

Test Failures


openshift-tests Monitor cluster while tests execute 20m7s

go run hack/e2e.go -v -test --test_args='--ginkgo.focus=openshift\-tests\sMonitor\scluster\swhile\stests\sexecute$'
8 error level events were detected during this test run:

Mar 25 18:32:04.833 E ns/openshift-monitoring pod/prometheus-k8s-0 node/compute-0 container=prometheus container exited with code 1 (Error): caller=main.go:648 msg="Starting TSDB ..."\nlevel=info ts=2020-03-25T18:32:00.761Z caller=web.go:506 component=web msg="Start listening for connections" address=127.0.0.1:9090\nlevel=info ts=2020-03-25T18:32:00.765Z caller=head.go:584 component=tsdb msg="replaying WAL, this may take awhile"\nlevel=info ts=2020-03-25T18:32:00.766Z caller=head.go:632 component=tsdb msg="WAL segment loaded" segment=0 maxSegment=0\nlevel=info ts=2020-03-25T18:32:00.766Z caller=main.go:663 fs_type=XFS_SUPER_MAGIC\nlevel=info ts=2020-03-25T18:32:00.767Z caller=main.go:664 msg="TSDB started"\nlevel=info ts=2020-03-25T18:32:00.767Z caller=main.go:734 msg="Loading configuration file" filename=/etc/prometheus/config_out/prometheus.env.yaml\nlevel=info ts=2020-03-25T18:32:00.767Z caller=main.go:517 msg="Stopping scrape discovery manager..."\nlevel=info ts=2020-03-25T18:32:00.767Z caller=main.go:531 msg="Stopping notify discovery manager..."\nlevel=info ts=2020-03-25T18:32:00.767Z caller=main.go:553 msg="Stopping scrape manager..."\nlevel=info ts=2020-03-25T18:32:00.767Z caller=main.go:527 msg="Notify discovery manager stopped"\nlevel=info ts=2020-03-25T18:32:00.767Z caller=main.go:513 msg="Scrape discovery manager stopped"\nlevel=info ts=2020-03-25T18:32:00.767Z caller=manager.go:814 component="rule manager" msg="Stopping rule manager..."\nlevel=info ts=2020-03-25T18:32:00.767Z caller=main.go:547 msg="Scrape manager stopped"\nlevel=info ts=2020-03-25T18:32:00.767Z caller=manager.go:820 component="rule manager" msg="Rule manager stopped"\nlevel=info ts=2020-03-25T18:32:00.767Z caller=notifier.go:598 component=notifier msg="Stopping notification manager..."\nlevel=info ts=2020-03-25T18:32:00.767Z caller=main.go:718 msg="Notifier manager stopped"\nlevel=error ts=2020-03-25
Mar 25 18:32:31.629 E ns/openshift-console pod/console-6b5dd9df54-dkjl2 node/control-plane-1 container=console container exited with code 2 (Error): 2020-03-25T18:28:23Z cmd/main: cookies are secure!\n2020-03-25T18:28:23Z auth: error contacting auth provider (retrying in 10s): discovery through endpoint https://kubernetes.default.svc/.well-known/oauth-authorization-server failed: 404 Not Found\n2020-03-25T18:28:33Z auth: error contacting auth provider (retrying in 10s): discovery through endpoint https://kubernetes.default.svc/.well-known/oauth-authorization-server failed: 404 Not Found\n2020-03-25T18:28:43Z cmd/main: Binding to [::]:8443...\n2020-03-25T18:28:43Z cmd/main: using TLS\n
Mar 25 18:36:38.178 E clusteroperator/etcd changed Degraded to True: EtcdMembers_UnhealthyMembers: EtcdMembersDegraded: control-plane-1 members are unhealthy,  members are unknown
Mar 25 18:40:10.518 E ns/openshift-marketplace pod/opsrctestlabel-f6464d5dc-qbnz2 node/compute-2 container=opsrctestlabel container exited with code 2 (Error): 
Mar 25 18:40:10.943 E ns/openshift-marketplace pod/csctestlabel-76bbd4b56-t224g node/compute-1 container=csctestlabel container exited with code 2 (Error): 
Mar 25 18:40:10.973 E ns/openshift-marketplace pod/csctestlabel-58f8646944-x74hc node/compute-1 container=csctestlabel container exited with code 2 (Error): 
Mar 25 18:41:55.459 E ns/default pod/recycler-for-nfs-4mgf7 node/compute-2 pod failed (DeadlineExceeded): Pod was active on the node longer than the specified deadline
Mar 25 18:46:46.043 E ns/openshift-marketplace pod/samename-7b5c8c874f-kgztc node/compute-1 container=samename container exited with code 2 (Error): 

				
				Click to see stdout/stderrfrom junit_e2e_20200325-185740.xml

Find failed mentions in log files


openshift-tests [sig-instrumentation][Late] Alerts shouldn't report any alerts in firing state apart from Watchdog and AlertmanagerReceiversNotConfigured [Suite:openshift/conformance/parallel] 1m21s

go run hack/e2e.go -v -test --test_args='--ginkgo.focus=openshift\-tests\s\[sig\-instrumentation\]\[Late\]\sAlerts\sshouldn\'t\sreport\sany\salerts\sin\sfiring\sstate\sapart\sfrom\sWatchdog\sand\sAlertmanagerReceiversNotConfigured\s\[Suite\:openshift\/conformance\/parallel\]$'
fail [github.com/openshift/origin/test/extended/prometheus/prometheus_builds.go:163]: Expected
    <map[string]error | len:1>: {
        "count_over_time(ALERTS{alertname!~\"Watchdog|AlertmanagerReceiversNotConfigured|KubeAPILatencyHigh\",alertstate=\"firing\",severity!=\"info\"}[2h]) >= 1": {
            s: "promQL query: count_over_time(ALERTS{alertname!~\"Watchdog|AlertmanagerReceiversNotConfigured|KubeAPILatencyHigh\",alertstate=\"firing\",severity!=\"info\"}[2h]) >= 1 had reported incorrect results:\n[{\"metric\":{\"alertname\":\"TargetDown\",\"alertstate\":\"firing\",\"job\":\"multus-admission-controller-monitor-service\",\"namespace\":\"openshift-multus\",\"service\":\"multus-admission-controller-monitor-service\",\"severity\":\"warning\"},\"value\":[1585162391.69,\"22\"]}]",
        },
    }
to be empty
				
				Click to see stdout/stderrfrom junit_e2e_20200325-185740.xml

Filter through log files


openshift-tests [sig-network] Networking Granular Checks: Services should function for endpoint-Service: udp [Skipped:Network/OVNKubernetes] [Suite:openshift/conformance/parallel] [Suite:k8s] 4m34s

go run hack/e2e.go -v -test --test_args='--ginkgo.focus=openshift\-tests\s\[sig\-network\]\sNetworking\sGranular\sChecks\:\sServices\sshould\sfunction\sfor\sendpoint\-Service\:\sudp\s\[Skipped\:Network\/OVNKubernetes\]\s\[Suite\:openshift\/conformance\/parallel\]\s\[Suite\:k8s\]$'
fail [k8s.io/kubernetes/test/e2e/framework/network/utils.go:269]: Mar 25 18:50:45.698: Failed to find expected responses:
Tries 39
Command curl -g -q -s 'http://10.128.3.206:8080/dial?request=hostname&protocol=udp&host=139.178.87.154&port=32475&tries=1'
retrieved map[netserver-0:{} netserver-1:{}]
expected map[netserver-0:{} netserver-1:{} netserver-2:{}]
				
				Click to see stdout/stderrfrom junit_e2e_20200325-185740.xml

Filter through log files


operator Run template e2e-vsphere - e2e-vsphere container test 25m49s

go run hack/e2e.go -v -test --test_args='--ginkgo.focus=operator\sRun\stemplate\se2e\-vsphere\s\-\se2e\-vsphere\scontainer\stest$'
r deployment/etcd-operator Updated ConfigMap/etcd-ca-bundle -n openshift-etcd-operator:\ncause by changes in data.ca-bundle.crt (9 times)
Mar 25 18:48:04.588 I ns/openshift-etcd-operator deployment/etcd-operator Updated Secret/etcd-client -n openshift-etcd-operator because it changed (9 times)
Mar 25 18:50:28.129 I ns/openshift-etcd-operator deployment/etcd-operator unhealthy members: control-plane-2 (19 times)
Mar 25 18:50:28.135 I ns/openshift-etcd-operator deployment/etcd-operator unhealthy members: control-plane-1,control-plane-0,control-plane-2 (26 times)
Mar 25 18:50:46.280 I test="[sig-network] Networking Granular Checks: Services should function for endpoint-Service: udp [Skipped:Network/OVNKubernetes] [Suite:openshift/conformance/parallel] [Suite:k8s]" failed
Mar 25 18:51:20.816 I ns/openshift-etcd-operator deployment/etcd-operator Updated ConfigMap/etcd-ca-bundle -n openshift-etcd-operator:\ncause by changes in data.ca-bundle.crt (10 times)
Mar 25 18:51:20.872 I ns/openshift-etcd-operator deployment/etcd-operator Updated Secret/etcd-client -n openshift-etcd-operator because it changed (10 times)
Mar 25 18:52:03.401 - 80s   I test="[sig-instrumentation][Late] Alerts shouldn't report any alerts in firing state apart from Watchdog and AlertmanagerReceiversNotConfigured [Suite:openshift/conformance/parallel]" running
Mar 25 18:53:24.335 I test="[sig-instrumentation][Late] Alerts shouldn't report any alerts in firing state apart from Watchdog and AlertmanagerReceiversNotConfigured [Suite:openshift/conformance/parallel]" failed

Failing tests:

[sig-instrumentation][Late] Alerts shouldn't report any alerts in firing state apart from Watchdog and AlertmanagerReceiversNotConfigured [Suite:openshift/conformance/parallel]
[sig-network] Networking Granular Checks: Services should function for endpoint-Service: udp [Skipped:Network/OVNKubernetes] [Suite:openshift/conformance/parallel] [Suite:k8s]

Writing JUnit report to /tmp/artifacts/junit/junit_e2e_20200325-185740.xml

error: 2 fail, 902 pass, 1386 skip (20m7s)

				from junit_operator.xml

Filter through log files


Show 912 Passed Tests

Show 1386 Skipped Tests