ResultFAILURE
Tests 4 failed / 35 succeeded
Started2020-03-23 21:10
Elapsed1h18m
Work namespaceci-op-jd20z667
Refs release-4.3:bfdc2fed
500:1a690c20
poda8264e1e-6d4a-11ea-aeac-0a58ac1072dd
repoopenshift/cluster-image-registry-operator
revision1

Test Failures


github.com/openshift/cluster-image-registry-operator/test/e2e 22m9s

go run hack/e2e.go -v -test --test_args='--ginkgo.focus=github\.com\/openshift\/cluster\-image\-registry\-operator\/test\/e2e\s$'
FAIL
FAIL	github.com/openshift/cluster-image-registry-operator/test/e2e	1329.102s

				from junit_go_test.xml

Filter through log files


github.com/openshift/cluster-image-registry-operator/test/e2e TestNodeCAGracefulShutdown 1.35s

go run hack/e2e.go -v -test --test_args='--ginkgo.focus=github\.com\/openshift\/cluster\-image\-registry\-operator\/test\/e2e\sTestNodeCAGracefulShutdown$'
=== RUN   TestNodeCAGracefulShutdown
--- FAIL: TestNodeCAGracefulShutdown (1.35s)
    logs.go:114: Get https://10.0.150.49:10250/containerLogs/openshift-image-registry/node-ca-2xxvw/node-ca?follow=true: dial tcp 10.0.150.49:10250: connect: connection refused

				from junit_go_test.xml

Filter through log files


github.com/openshift/cluster-image-registry-operator/test/e2e TestSecureRouteConfiguration 1m31s

go run hack/e2e.go -v -test --test_args='--ginkgo.focus=github\.com\/openshift\/cluster\-image\-registry\-operator\/test\/e2e\sTestSecureRouteConfiguration$'
=== RUN   TestSecureRouteConfiguration
W0323 21:58:39.643871    6380 secret.go:37] secret "openshift-image-registry/testroute-tls" not found: secrets "testroute-tls" not found, creating
--- FAIL: TestSecureRouteConfiguration (91.61s)
    imageregistry.go:180: creating the image registry resource...
    imageregistry.go:185: starting the operator...
    imageregistry.go:249: waiting for the operator to deploy the registry...
    imageregistry.go:229: waiting for the registry: available (<unset>), progressing (<unset>), Degraded (<unset>), removed (<unset>)
    imageregistry.go:229: waiting for the registry: available (<unset>), progressing (<unset>), Degraded (<unset>), removed (<unset>)
    imageregistry.go:229: waiting for the registry: available (False), progressing (True), Degraded (False), removed (False)
    imageregistry.go:229: waiting for the registry: available (True), progressing (True), Degraded (False), removed (False)
    imageregistry.go:229: waiting for the registry: available (True), progressing (False), Degraded (False), removed (False)
    imageregistry.go:263: the image registry resource reports that the registry is deployed and available
    configuration_test.go:444: unable to get route: the server is currently unable to handle the request (get routes.route.openshift.io testroute)
    imageregistry.go:157: uninstalling the image registry...
    imageregistry.go:113: waiting for the registry to be removed: available (False), progressing (True), Degraded (False), removed (True)
    imageregistry.go:113: waiting for the registry to be removed: available (False), progressing (True), Degraded (False), removed (True)
    imageregistry.go:113: waiting for the registry to be removed: available (False), progressing (True), Degraded (False), removed (True)
    imageregistry.go:113: waiting for the registry to be removed: available (False), progressing (True), Degraded (False), removed (True)
    imageregistry.go:113: waiting for the registry to be removed: available (False), progressing (True), Degraded (False), removed (True)
    imageregistry.go:113: waiting for the registry to be removed: available (True), progressing (False), Degraded (False), removed (True)
    imageregistry.go:161: stopping the operator...
    imageregistry.go:165: deleting the image registry resource...

				from junit_go_test.xml

Filter through log files


operator Run template e2e-aws-operator - e2e-aws-operator container test 22m51s

go run hack/e2e.go -v -test --test_args='--ginkgo.focus=operator\sRun\stemplate\se2e\-aws\-operator\s\-\se2e\-aws\-operator\scontainer\stest$'
secret/support created
./hack/test-go.sh -count 1 -timeout 2h -v${WHAT:+ -run="$WHAT"} ./test/e2e/
make: *** [test-e2e] Error 1

				from junit_operator.xml

Filter through log files


Show 35 Passed Tests

Show 2 Skipped Tests