ResultFAILURE
Tests 3 failed / 36 succeeded
Started2020-04-18 15:35
Elapsed1h14m
Work namespaceci-op-t840q500
Refs release-4.3:8952a09a
504:84e3afee
pod25b90601-818a-11ea-95fc-0a58ac104965
repoopenshift/cluster-image-registry-operator
revision1

Test Failures


github.com/openshift/cluster-image-registry-operator/test/e2e 21m9s

go run hack/e2e.go -v -test --test_args='--ginkgo.focus=github\.com\/openshift\/cluster\-image\-registry\-operator\/test\/e2e\s$'
FAIL
FAIL	github.com/openshift/cluster-image-registry-operator/test/e2e	1269.849s

				from junit_go_test.xml

Filter through log files


github.com/openshift/cluster-image-registry-operator/test/e2e TestRemovedToManagedTransition 11s

go run hack/e2e.go -v -test --test_args='--ginkgo.focus=github\.com\/openshift\/cluster\-image\-registry\-operator\/test\/e2e\sTestRemovedToManagedTransition$'
=== RUN   TestRemovedToManagedTransition
--- FAIL: TestRemovedToManagedTransition (11.25s)
    managementstate_test.go:144: creating config with ManagementState set to Removed
    imageregistry.go:180: creating the image registry resource...
    imageregistry.go:185: starting the operator...
    managementstate_test.go:155: make sure operator is reporting itself as Removed
    managementstate_test.go:176: updating ManagementState to Managed with no storage config
    managementstate_test.go:180: Operation cannot be fulfilled on configs.imageregistry.operator.openshift.io "cluster": the object has been modified; please apply your changes to the latest version and try again
    imageregistry.go:157: uninstalling the image registry...
    imageregistry.go:113: waiting for the registry to be removed: available (True), progressing (False), Degraded (False), removed (True)
    imageregistry.go:161: stopping the operator...
    imageregistry.go:165: deleting the image registry resource...

				from junit_go_test.xml

Filter through log files


operator Run template e2e-aws-operator - e2e-aws-operator container test 21m45s

go run hack/e2e.go -v -test --test_args='--ginkgo.focus=operator\sRun\stemplate\se2e\-aws\-operator\s\-\se2e\-aws\-operator\scontainer\stest$'
secret/support created
./hack/test-go.sh -count 1 -timeout 2h -v${WHAT:+ -run="$WHAT"} ./test/e2e/
make: *** [test-e2e] Error 1

				from junit_operator.xml

Filter through log files


Show 36 Passed Tests

Show 2 Skipped Tests