ResultFAILURE
Tests 3 failed / 36 succeeded
Started2020-04-18 16:57
Elapsed1h17m
Work namespaceci-op-2424tlnp
Refs release-4.3:8952a09a
504:84e3afee
pod9d3f7c65-8195-11ea-9d1e-0a58ac10e230
repoopenshift/cluster-image-registry-operator
revision1

Test Failures


github.com/openshift/cluster-image-registry-operator/test/e2e 24m54s

go run hack/e2e.go -v -test --test_args='--ginkgo.focus=github\.com\/openshift\/cluster\-image\-registry\-operator\/test\/e2e\s$'
FAIL
FAIL	github.com/openshift/cluster-image-registry-operator/test/e2e	1494.703s

				from junit_go_test.xml

Filter through log files


github.com/openshift/cluster-image-registry-operator/test/e2e TestNodeCAGracefulShutdown 1.35s

go run hack/e2e.go -v -test --test_args='--ginkgo.focus=github\.com\/openshift\/cluster\-image\-registry\-operator\/test\/e2e\sTestNodeCAGracefulShutdown$'
=== RUN   TestNodeCAGracefulShutdown
--- FAIL: TestNodeCAGracefulShutdown (1.35s)
    logs.go:114: Get https://10.0.134.13:10250/containerLogs/openshift-image-registry/node-ca-284p9/node-ca?follow=true: dial tcp 10.0.134.13:10250: connect: connection refused

				from junit_go_test.xml

Filter through log files


operator Run template e2e-aws-operator - e2e-aws-operator container test 25m21s

go run hack/e2e.go -v -test --test_args='--ginkgo.focus=operator\sRun\stemplate\se2e\-aws\-operator\s\-\se2e\-aws\-operator\scontainer\stest$'
secret/support created
./hack/test-go.sh -count 1 -timeout 2h -v${WHAT:+ -run="$WHAT"} ./test/e2e/
make: *** [test-e2e] Error 1

				from junit_operator.xml

Filter through log files


Show 36 Passed Tests

Show 2 Skipped Tests