ResultFAILURE
Tests 3 failed / 36 succeeded
Started2020-04-17 06:24
Elapsed1h25m
Work namespaceci-op-xcc4ptjs
Refs release-4.3:afad871b
511:c794a736
podf7d64670-8073-11ea-9883-0a58ac10fbe1
repoopenshift/cluster-image-registry-operator
revision1

Test Failures


github.com/openshift/cluster-image-registry-operator/test/e2e 25m28s

go run hack/e2e.go -v -test --test_args='--ginkgo.focus=github\.com\/openshift\/cluster\-image\-registry\-operator\/test\/e2e\s$'
FAIL
FAIL	github.com/openshift/cluster-image-registry-operator/test/e2e	1528.507s

				from junit_go_test.xml

Filter through log files


github.com/openshift/cluster-image-registry-operator/test/e2e TestNodeCAGracefulShutdown 1.26s

go run hack/e2e.go -v -test --test_args='--ginkgo.focus=github\.com\/openshift\/cluster\-image\-registry\-operator\/test\/e2e\sTestNodeCAGracefulShutdown$'
=== RUN   TestNodeCAGracefulShutdown
--- FAIL: TestNodeCAGracefulShutdown (1.26s)
    logs.go:114: Get https://10.0.140.99:10250/containerLogs/openshift-image-registry/node-ca-gsmqv/node-ca?follow=true: dial tcp 10.0.140.99:10250: connect: connection refused

				from junit_go_test.xml

Filter through log files


operator Run template e2e-aws-operator - e2e-aws-operator container test 25m50s

go run hack/e2e.go -v -test --test_args='--ginkgo.focus=operator\sRun\stemplate\se2e\-aws\-operator\s\-\se2e\-aws\-operator\scontainer\stest$'
secret/support created
./hack/test-go.sh -count 1 -timeout 2h -v${WHAT:+ -run="$WHAT"} ./test/e2e/
make: *** [test-e2e] Error 1

				from junit_operator.xml

Filter through log files


Show 36 Passed Tests

Show 2 Skipped Tests