ResultFAILURE
Tests 2 failed / 10 succeeded
Started2020-04-22 17:18
Elapsed18m4s
Work namespaceci-op-1xc3qxz4
Refs release-4.3:344a182f
533:38e0de90
pod4288426b-84bd-11ea-8457-0a58ac105459
repoopenshift/cluster-image-registry-operator
revision1

Test Failures


job initialize 0.00s

go run hack/e2e.go -v -test --test_args='--ginkgo.focus=job\sinitialize$'
could not run steps: step e2e-aws-operator failed: template pod "e2e-aws-operator" failed: the pod ci-op-1xc3qxz4/e2e-aws-operator failed after 2m30s (failed containers: setup): ContainerFailed one or more containers exited

Container setup exited with code 1, reason Error
---
Installing from release registry.svc.ci.openshift.org/ci-op-1xc3qxz4/release@sha256:5425020b9d368a6f563934aadd0ecdc9d2d99910a8f3afcea77b6b15b9ae41fa
AWS region: us-west-2 (zones: us-west-2a us-west-2b)
level=warning msg="Found override for release image. Please be warned, this is not advised"
level=info msg="Consuming Install Config from target directory"
level=fatal msg="failed to fetch Cluster: failed to fetch dependency of \"Cluster\": failed to generate asset \"Platform Permissions Check\": validate AWS credentials: checking install permissions: error simulating policy: Throttling: Rate exceeded\n\tstatus code: 400, request id: bbd28353-e68d-4e1a-97c4-7e2aa422e72e"
---
				from junit_job.xml

Find e2e-aws-operator mentions in log files


operator Run template e2e-aws-operator - e2e-aws-operator container setup 16s

go run hack/e2e.go -v -test --test_args='--ginkgo.focus=operator\sRun\stemplate\se2e\-aws\-operator\s\-\se2e\-aws\-operator\scontainer\ssetup$'
Installing from release registry.svc.ci.openshift.org/ci-op-1xc3qxz4/release@sha256:5425020b9d368a6f563934aadd0ecdc9d2d99910a8f3afcea77b6b15b9ae41fa
AWS region: us-west-2 (zones: us-west-2a us-west-2b)
level=warning msg="Found override for release image. Please be warned, this is not advised"
level=info msg="Consuming Install Config from target directory"
level=fatal msg="failed to fetch Cluster: failed to fetch dependency of \"Cluster\": failed to generate asset \"Platform Permissions Check\": validate AWS credentials: checking install permissions: error simulating policy: Throttling: Rate exceeded\n\tstatus code: 400, request id: bbd28353-e68d-4e1a-97c4-7e2aa422e72e"

				from junit_operator.xml

Filter through log files


Show 10 Passed Tests