ResultFAILURE
Tests 6 failed / 675 succeeded
Started2020-04-22 23:33
Elapsed1h18m
Work namespaceci-op-4sqkzh0k
Refs release-4.1:7d8f4dd7
535:7c568665
poda43f1d46-84f1-11ea-8457-0a58ac105459
repoopenshift/cluster-image-registry-operator
revision1

Test Failures


job initialize 0.00s

go run hack/e2e.go -v -test --test_args='--ginkgo.focus=job\sinitialize$'
could not run steps: step e2e-aws failed: "e2e-aws" post steps failed: "e2e-aws" pod "e2e-aws-gather-audit-logs" failed: the pod ci-op-4sqkzh0k/e2e-aws-gather-audit-logs failed after 30s (failed containers: test): ContainerFailed one or more containers exited

Container test exited with code 1, reason Error
---
ute.internal --path=kube-apiserver/audit-2020-04-23T00-47-23.106.log
/usr/bin/oc adm node-logs ip-10-0-137-157.us-west-2.compute.internal --path=kube-apiserver/audit.log
/usr/bin/oc adm node-logs ip-10-0-155-178.us-west-2.compute.internal --path=kube-apiserver/audit.log
INFO: Audit logs for kube-apiserver collected.
receiving incremental file list
./
audit_logs/
audit_logs/kube-apiserver.audit_logs_listing
audit_logs/openshift-apiserver.audit_logs_listing
audit_logs/kube-apiserver/
audit_logs/kube-apiserver/ip-10-0-134-126.us-west-2.compute.internal-audit-2020-04-23T00-14-46.321.log.gz
audit_logs/kube-apiserver/ip-10-0-134-126.us-west-2.compute.internal-audit-2020-04-23T00-32-02.140.log.gz
audit_logs/kube-apiserver/ip-10-0-134-126.us-west-2.compute.internal-audit.log.gz
audit_logs/kube-apiserver/ip-10-0-137-157.us-west-2.compute.internal-audit-2020-04-23T00-11-44.564.log.gz
audit_logs/kube-apiserver/ip-10-0-137-157.us-west-2.compute.internal-audit-2020-04-23T00-18-24.933.log.gz
audit_logs/kube-apiserver/ip-10-0-137-157.us-west-2.compute.internal-audit-2020-04-23T00-24-37.421.log.gz
audit_logs/kube-apiserver/ip-10-0-137-157.us-west-2.compute.internal-audit-2020-04-23T00-33-30.663.log.gz
audit_logs/kube-apiserver/ip-10-0-137-157.us-west-2.compute.internal-audit-2020-04-23T00-47-23.106.log.gz
audit_logs/kube-apiserver/ip-10-0-137-157.us-west-2.compute.internal-audit.log.gz
audit_logs/openshift-apiserver/
audit_logs/openshift-apiserver/ip-10-0-134-126.us-west-2.compute.internal-audit.log.gz
audit_logs/openshift-apiserver/ip-10-0-137-157.us-west-2.compute.internal-audit.log.gz
audit_logs/openshift-apiserver/ip-10-0-155-178.us-west-2.compute.internal-audit.log.gz

sent 313 bytes  received 657,713 bytes  263,210.40 bytes/sec
total size is 656,217  speedup is 1.00
clusterrolebinding.rbac.authorization.k8s.io/must-gather-dn9km deleted
namespace/openshift-must-gather-849rx deleted
mv: cannot stat '/tmp/artifacts/tmp.g0iYrHqacv/*/audit_logs': No such file or directory
error: failed to execute wrapped command: exit status 1
---
				from junit_job.xml

Find e2e-aws-gather-audit-logs mentions in log files


openshift-tests Monitor cluster while tests execute 37m39s

go run hack/e2e.go -v -test --test_args='--ginkgo.focus=openshift\-tests\sMonitor\scluster\swhile\stests\sexecute$'
1 error level events were detected during this test run:

Apr 23 00:04:32.871 E ns/openshift-console pod/console-7896dcd676-qkntj node/ip-10-0-155-178.us-west-2.compute.internal container=console container exited with code 2 (Error): ps://172.30.0.1:443/.well-known/oauth-authorization-server failed: 404 Not Found\n2020/04/22 23:59:17 auth: error contacting auth provider (retrying in 10s): discovery through endpoint https://172.30.0.1:443/.well-known/oauth-authorization-server failed: 404 Not Found\n2020/04/22 23:59:27 auth: error contacting auth provider (retrying in 10s): discovery through endpoint https://172.30.0.1:443/.well-known/oauth-authorization-server failed: 404 Not Found\n2020/04/22 23:59:37 auth: error contacting auth provider (retrying in 10s): discovery through endpoint https://172.30.0.1:443/.well-known/oauth-authorization-server failed: 404 Not Found\n2020/04/22 23:59:47 auth: error contacting auth provider (retrying in 10s): discovery through endpoint https://172.30.0.1:443/.well-known/oauth-authorization-server failed: 404 Not Found\n2020/04/22 23:59:57 auth: error contacting auth provider (retrying in 10s): discovery through endpoint https://172.30.0.1:443/.well-known/oauth-authorization-server failed: 404 Not Found\n2020/04/23 00:00:07 auth: error contacting auth provider (retrying in 10s): discovery through endpoint https://172.30.0.1:443/.well-known/oauth-authorization-server failed: 404 Not Found\n2020/04/23 00:00:17 auth: error contacting auth provider (retrying in 10s): discovery through endpoint https://172.30.0.1:443/.well-known/oauth-authorization-server failed: 404 Not Found\n2020/04/23 00:00:27 auth: error contacting auth provider (retrying in 10s): discovery through endpoint https://172.30.0.1:443/.well-known/oauth-authorization-server failed: 404 Not Found\n2020/04/23 00:00:37 auth: error contacting auth provider (retrying in 10s): discovery through endpoint https://172.30.0.1:443/.well-known/oauth-authorization-server failed: 404 Not Found\n2020/04/23 00:00:47 auth: error contacting auth provider (retrying in 10s): discovery through endpoint https://172.30.0.1:443/.well-known/oauth-authorization-server failed: 404 Not Found\n2020/04/23 00:00:57 cmd/main: Binding to 0.0.0.0:8443...\n2020/04/23 00:00:57 cmd/main: using TLS\n

				
				Click to see stdout/stderrfrom junit_e2e_20200423-004437.xml

Filter through log files


openshift-tests [Feature:Builds][pruning] prune builds based on settings in the buildconfig should prune completed builds based on the successfulBuildsHistoryLimit setting [Suite:openshift/conformance/parallel] 1m4s

go run hack/e2e.go -v -test --test_args='--ginkgo.focus=openshift\-tests\s\[Feature\:Builds\]\[pruning\]\sprune\sbuilds\sbased\son\ssettings\sin\sthe\sbuildconfig\s\sshould\sprune\scompleted\sbuilds\sbased\son\sthe\ssuccessfulBuildsHistoryLimit\ssetting\s\[Suite\:openshift\/conformance\/parallel\]$'
fail [github.com/openshift/origin/test/extended/builds/build_pruning.go:69]: Expected
    <bool>: false
to be true
				
				Click to see stdout/stderrfrom junit_e2e_20200423-004437.xml

Filter through log files


openshift-tests [sig-network] NetworkPolicy NetworkPolicy between server and client should enforce policy based on PodSelector [Feature:NetworkPolicy] [Suite:openshift/conformance/parallel] [Suite:k8s] 1m17s

go run hack/e2e.go -v -test --test_args='--ginkgo.focus=openshift\-tests\s\[sig\-network\]\sNetworkPolicy\sNetworkPolicy\sbetween\sserver\sand\sclient\sshould\senforce\spolicy\sbased\son\sPodSelector\s\[Feature\:NetworkPolicy\]\s\[Suite\:openshift\/conformance\/parallel\]\s\[Suite\:k8s\]$'
fail [k8s.io/kubernetes/test/e2e/e2e.go:101]: Expected error:
    <*errors.errorString | 0xc000c461a0>: {
        s: "couldn't get version/kind; json parse error: invalid character 'T' after top-level value",
    }
    couldn't get version/kind; json parse error: invalid character 'T' after top-level value
not to have occurred
				
				Click to see stdout/stderrfrom junit_e2e_20200423-004437.xml

Filter through log files


openshift-tests [sig-storage] In-tree Volumes [Driver: nfs] [Testpattern: Pre-provisioned PV (default fs)] subPath should support readOnly file specified in the volumeMount [Suite:openshift/conformance/parallel] [Suite:k8s] 8m51s

go run hack/e2e.go -v -test --test_args='--ginkgo.focus=openshift\-tests\s\[sig\-storage\]\sIn\-tree\sVolumes\s\[Driver\:\snfs\]\s\[Testpattern\:\sPre\-provisioned\sPV\s\(default\sfs\)\]\ssubPath\sshould\ssupport\sreadOnly\sfile\sspecified\sin\sthe\svolumeMount\s\[Suite\:openshift\/conformance\/parallel\]\s\[Suite\:k8s\]$'
fail [k8s.io/kubernetes/test/e2e/storage/drivers/in_tree.go:155]: Failed to update authorization: Post https://api.ci-op-4sqkzh0k-78004.origin-ci-int-aws.dev.rhcloud.com:6443/apis/authorization.k8s.io/v1beta1/subjectaccessreviews: read tcp 172.16.195.228:36200->52.26.195.102:6443: read: connection reset by peer
Expected error:
    <*url.Error | 0xc002b82000>: {
        Op: "Post",
        URL: "https://api.ci-op-4sqkzh0k-78004.origin-ci-int-aws.dev.rhcloud.com:6443/apis/authorization.k8s.io/v1beta1/subjectaccessreviews",
        Err: {
            Op: "read",
            Net: "tcp",
            Source: {
                IP: [172, 16, 195, 228],
                Port: 36200,
                Zone: "",
            },
            Addr: {
                IP: [52, 26, 195, 102],
                Port: 6443,
                Zone: "",
            },
            Err: {Syscall: "read", Err: 0x68},
        },
    }
    Post https://api.ci-op-4sqkzh0k-78004.origin-ci-int-aws.dev.rhcloud.com:6443/apis/authorization.k8s.io/v1beta1/subjectaccessreviews: read tcp 172.16.195.228:36200->52.26.195.102:6443: read: connection reset by peer
not to have occurred
				
				Click to see stdout/stderrfrom junit_e2e_20200423-004437.xml

Filter through log files


operator Run multi-stage test e2e-aws - e2e-aws-gather-audit-logs container test 26s

go run hack/e2e.go -v -test --test_args='--ginkgo.focus=operator\sRun\smulti\-stage\stest\se2e\-aws\s\-\se2e\-aws\-gather\-audit\-logs\scontainer\stest$'
ute.internal --path=kube-apiserver/audit-2020-04-23T00-47-23.106.log
/usr/bin/oc adm node-logs ip-10-0-137-157.us-west-2.compute.internal --path=kube-apiserver/audit.log
/usr/bin/oc adm node-logs ip-10-0-155-178.us-west-2.compute.internal --path=kube-apiserver/audit.log
INFO: Audit logs for kube-apiserver collected.
receiving incremental file list
./
audit_logs/
audit_logs/kube-apiserver.audit_logs_listing
audit_logs/openshift-apiserver.audit_logs_listing
audit_logs/kube-apiserver/
audit_logs/kube-apiserver/ip-10-0-134-126.us-west-2.compute.internal-audit-2020-04-23T00-14-46.321.log.gz
audit_logs/kube-apiserver/ip-10-0-134-126.us-west-2.compute.internal-audit-2020-04-23T00-32-02.140.log.gz
audit_logs/kube-apiserver/ip-10-0-134-126.us-west-2.compute.internal-audit.log.gz
audit_logs/kube-apiserver/ip-10-0-137-157.us-west-2.compute.internal-audit-2020-04-23T00-11-44.564.log.gz
audit_logs/kube-apiserver/ip-10-0-137-157.us-west-2.compute.internal-audit-2020-04-23T00-18-24.933.log.gz
audit_logs/kube-apiserver/ip-10-0-137-157.us-west-2.compute.internal-audit-2020-04-23T00-24-37.421.log.gz
audit_logs/kube-apiserver/ip-10-0-137-157.us-west-2.compute.internal-audit-2020-04-23T00-33-30.663.log.gz
audit_logs/kube-apiserver/ip-10-0-137-157.us-west-2.compute.internal-audit-2020-04-23T00-47-23.106.log.gz
audit_logs/kube-apiserver/ip-10-0-137-157.us-west-2.compute.internal-audit.log.gz
audit_logs/openshift-apiserver/
audit_logs/openshift-apiserver/ip-10-0-134-126.us-west-2.compute.internal-audit.log.gz
audit_logs/openshift-apiserver/ip-10-0-137-157.us-west-2.compute.internal-audit.log.gz
audit_logs/openshift-apiserver/ip-10-0-155-178.us-west-2.compute.internal-audit.log.gz

sent 313 bytes  received 657,713 bytes  263,210.40 bytes/sec
total size is 656,217  speedup is 1.00
clusterrolebinding.rbac.authorization.k8s.io/must-gather-dn9km deleted
namespace/openshift-must-gather-849rx deleted
mv: cannot stat '/tmp/artifacts/tmp.g0iYrHqacv/*/audit_logs': No such file or directory
error: failed to execute wrapped command: exit status 1

				from junit_operator.xml

Filter through log files


Show 675 Passed Tests

Show 528 Skipped Tests