ResultFAILURE
Tests 5 failed / 35 succeeded
Started2020-04-24 13:18
Elapsed1h27m
Work namespaceci-op-ckdz8dqd
Refs release-4.3:344a182f
536:9c427860
pod0aed0313-862e-11ea-b6a3-0a58ac10a4c4
repoopenshift/cluster-image-registry-operator
revision1

Test Failures


github.com/openshift/cluster-image-registry-operator/test/e2e 25m50s

go run hack/e2e.go -v -test --test_args='--ginkgo.focus=github\.com\/openshift\/cluster\-image\-registry\-operator\/test\/e2e\s$'
FAIL
FAIL	github.com/openshift/cluster-image-registry-operator/test/e2e	1550.211s

				from junit_go_test.xml

Filter through log files


github.com/openshift/cluster-image-registry-operator/test/e2e TestNodeCAGracefulShutdown 1.37s

go run hack/e2e.go -v -test --test_args='--ginkgo.focus=github\.com\/openshift\/cluster\-image\-registry\-operator\/test\/e2e\sTestNodeCAGracefulShutdown$'
=== RUN   TestNodeCAGracefulShutdown
--- FAIL: TestNodeCAGracefulShutdown (1.37s)
    logs.go:114: Get https://10.0.138.63:10250/containerLogs/openshift-image-registry/node-ca-2jq6c/node-ca?follow=true: dial tcp 10.0.138.63:10250: connect: connection refused

				from junit_go_test.xml

Filter through log files


github.com/openshift/cluster-image-registry-operator/test/e2e TestSecureRouteConfiguration 2m42s

go run hack/e2e.go -v -test --test_args='--ginkgo.focus=github\.com\/openshift\/cluster\-image\-registry\-operator\/test\/e2e\sTestSecureRouteConfiguration$'
=== RUN   TestSecureRouteConfiguration
W0424 14:13:54.183348    6960 secret.go:37] secret "openshift-image-registry/testroute-tls" not found: secrets "testroute-tls" not found, creating
--- FAIL: TestSecureRouteConfiguration (162.32s)
    imageregistry.go:180: creating the image registry resource...
    imageregistry.go:185: starting the operator...
    imageregistry.go:249: waiting for the operator to deploy the registry...
    imageregistry.go:229: waiting for the registry: available (False), progressing (True), Degraded (False), removed (False)
    imageregistry.go:229: waiting for the registry: available (False), progressing (True), Degraded (False), removed (False)
    imageregistry.go:229: waiting for the registry: available (True), progressing (False), Degraded (False), removed (False)
    imageregistry.go:263: the image registry resource reports that the registry is deployed and available
    configuration_test.go:444: unable to get route: the server is currently unable to handle the request (get routes.route.openshift.io testroute)
    imageregistry.go:157: uninstalling the image registry...
    imageregistry.go:113: waiting for the registry to be removed: available (False), progressing (True), Degraded (False), removed (True)
    imageregistry.go:113: waiting for the registry to be removed: available (False), progressing (True), Degraded (False), removed (True)
    imageregistry.go:113: waiting for the registry to be removed: available (False), progressing (True), Degraded (False), removed (True)
    imageregistry.go:113: waiting for the registry to be removed: available (False), progressing (True), Degraded (False), removed (True)
    imageregistry.go:113: waiting for the registry to be removed: available (False), progressing (True), Degraded (False), removed (True)
    imageregistry.go:113: waiting for the registry to be removed: available (False), progressing (True), Degraded (False), removed (True)
    imageregistry.go:113: waiting for the registry to be removed: available (False), progressing (True), Degraded (False), removed (True)
    imageregistry.go:113: waiting for the registry to be removed: available (False), progressing (True), Degraded (False), removed (True)
    imageregistry.go:113: waiting for the registry to be removed: available (False), progressing (True), Degraded (False), removed (True)
    imageregistry.go:113: waiting for the registry to be removed: available (False), progressing (True), Degraded (False), removed (True)
    imageregistry.go:113: waiting for the registry to be removed: available (False), progressing (True), Degraded (False), removed (True)
    imageregistry.go:113: waiting for the registry to be removed: available (False), progressing (True), Degraded (False), removed (True)
    imageregistry.go:113: waiting for the registry to be removed: available (False), progressing (True), Degraded (False), removed (True)
    imageregistry.go:113: waiting for the registry to be removed: available (False), progressing (True), Degraded (False), removed (True)
    imageregistry.go:113: waiting for the registry to be removed: available (False), progressing (True), Degraded (False), removed (True)
    imageregistry.go:113: waiting for the registry to be removed: available (False), progressing (True), Degraded (False), removed (True)
    imageregistry.go:113: waiting for the registry to be removed: available (False), progressing (True), Degraded (False), removed (True)
    imageregistry.go:113: waiting for the registry to be removed: available (False), progressing (True), Degraded (False), removed (True)
    imageregistry.go:113: waiting for the registry to be removed: available (False), progressing (True), Degraded (False), removed (True)
    imageregistry.go:113: waiting for the registry to be removed: available (False), progressing (True), Degraded (False), removed (True)
    imageregistry.go:113: waiting for the registry to be removed: available (False), progressing (True), Degraded (False), removed (True)
    imageregistry.go:113: waiting for the registry to be removed: available (True), progressing (False), Degraded (False), removed (True)
    imageregistry.go:161: stopping the operator...
    imageregistry.go:165: deleting the image registry resource...

				from junit_go_test.xml

Filter through log files


job initialize 0.00s

go run hack/e2e.go -v -test --test_args='--ginkgo.focus=job\sinitialize$'
could not run steps: step e2e-aws-operator failed: template pod "e2e-aws-operator" failed: the pod ci-op-ckdz8dqd/e2e-aws-operator failed after 1h18m7s (failed containers: test): ContainerFailed one or more containers exited

Container test exited with code 2, reason Error
---
secret/support created
./hack/test-go.sh -count 1 -timeout 2h -v${WHAT:+ -run="$WHAT"} ./test/e2e/
make: *** [test-e2e] Error 1
---
				from junit_job.xml

Find e2e-aws-operator mentions in log files


operator Run template e2e-aws-operator - e2e-aws-operator container test 26m35s

go run hack/e2e.go -v -test --test_args='--ginkgo.focus=operator\sRun\stemplate\se2e\-aws\-operator\s\-\se2e\-aws\-operator\scontainer\stest$'
secret/support created
./hack/test-go.sh -count 1 -timeout 2h -v${WHAT:+ -run="$WHAT"} ./test/e2e/
make: *** [test-e2e] Error 1

				from junit_operator.xml

Filter through log files


Show 35 Passed Tests

Show 2 Skipped Tests