ResultFAILURE
Tests 2 failed / 4 succeeded
Started2020-04-22 16:56
Elapsed3m42s
Work namespaceci-op-9n7tzmnv
Refs release-4.3:344a182f
536:e3fdcdc8
pod1690e58d-84ba-11ea-ae79-0a58ac104279
repoopenshift/cluster-image-registry-operator
revision1

Test Failures


job initialize 0.00s

go run hack/e2e.go -v -test --test_args='--ginkgo.focus=job\sinitialize$'
could not run steps: step cluster-image-registry-operator failed: could not wait for build: the build cluster-image-registry-operator failed after 1m15s with reason DockerBuildFailed: Docker build strategy has failed.

building cluster-image-registry-operator...
# github.com/openshift/cluster-image-registry-operator/pkg/storage
pkg/storage/storage.go:108:13: assignment mismatch: 2 variables but GetPlatformStorage returns 3 values
make: *** [build] Error 2
error: build error: running 'make build' failed with exit code 2
				from junit_job.xml

Filter through log files


operator Build image cluster-image-registry-operator from the repository 1m16s

go run hack/e2e.go -v -test --test_args='--ginkgo.focus=operator\sBuild\simage\scluster\-image\-registry\-operator\sfrom\sthe\srepository$'
could not wait for build: the build cluster-image-registry-operator failed after 1m15s with reason DockerBuildFailed: Docker build strategy has failed.

building cluster-image-registry-operator...
# github.com/openshift/cluster-image-registry-operator/pkg/storage
pkg/storage/storage.go:108:13: assignment mismatch: 2 variables but GetPlatformStorage returns 3 values
make: *** [build] Error 2
error: build error: running 'make build' failed with exit code 2
				from junit_operator.xml

Filter through log files


Show 4 Passed Tests