ResultFAILURE
Tests 1 failed / 10 succeeded
Started2019-05-01 12:36
Elapsed46m46s
Work namespaceci-op-f2nyhc12
Refs master:5eac1771
222:d3de1246
pod9a277eb7-6c0d-11e9-8a13-0a58ac106623
repoopenshift/cluster-ingress-operator

Test Failures


operator Run template e2e-aws-operator - e2e-aws-operator container test 1m51s

go run hack/e2e.go -v -test --test_args='--ginkgo.focus=operator\sRun\stemplate\se2e\-aws\-operator\s\-\se2e\-aws\-operator\scontainer\stest$'
erCA
--- PASS: TestShouldPublishRouterCA (0.00s)
PASS
ok  	github.com/openshift/cluster-ingress-operator/pkg/operator/controller/certificate	0.031s
2019-05-01T13:16:07.924Z	INFO	operator	log/log.go:26	started zapr logger
=== RUN   TestDesiredRouterCertsGlobalSecret
--- PASS: TestDesiredRouterCertsGlobalSecret (0.00s)
PASS
ok  	github.com/openshift/cluster-ingress-operator/pkg/operator/controller/certificate-publisher	0.032s
?   	github.com/openshift/cluster-ingress-operator/pkg/util/slice	[no test files]
2019-05-01T13:16:08.118Z	INFO	operator	log/log.go:26	started zapr logger
=== RUN   TestCreateIngressControllerThenSecret
--- PASS: TestCreateIngressControllerThenSecret (2.75s)
=== RUN   TestCreateSecretThenIngressController
--- PASS: TestCreateSecretThenIngressController (2.67s)
=== RUN   TestOperatorAvailable
--- PASS: TestOperatorAvailable (1.54s)
=== RUN   TestDefaultIngressControllerExists
--- PASS: TestDefaultIngressControllerExists (1.54s)
=== RUN   TestIngressControllerControllerCreateDelete
--- PASS: TestIngressControllerControllerCreateDelete (29.70s)
=== RUN   TestClusterProxyProtocol
--- PASS: TestClusterProxyProtocol (1.61s)
=== RUN   TestIngressControllerUpdate
--- FAIL: TestIngressControllerUpdate (12.79s)
	operator_test.go:367: failed to reset IngressController: Operation cannot be fulfilled on ingresscontrollers.operator.openshift.io "default": the object has been modified; please apply your changes to the latest version and try again
	operator_test.go:381: failed to get recreated CA certificate configmap: timed out waiting for the condition
=== RUN   TestIngressControllerScale
--- PASS: TestIngressControllerScale (3.68s)
=== RUN   TestRouterCACertificate
--- FAIL: TestRouterCACertificate (11.60s)
	operator_test.go:595: failed to get CA certificate: timed out waiting for the condition
=== RUN   TestHostNetworkEndpointPublishingStrategy
--- PASS: TestHostNetworkEndpointPublishingStrategy (20.63s)
FAIL
FAIL	github.com/openshift/cluster-ingress-operator/test/e2e	88.547s
make: *** [test-e2e] Error 1

				from junit_operator.xml

Filter through log files


Show 10 Passed Tests

Error lines from build-log.txt

... skipping 142 lines ...