ResultFAILURE
Tests 1 failed / 2 succeeded
Started2020-09-23 20:05
Elapsed8m4s
Work namespaceci-op-462n41zp
Refs master:8a8fcb19
29:b4ce35a7
pod2ea2f5ca-fdd8-11ea-bce6-0a580a810c09
repoopenshift/coredns-mdns
revision1

Test Failures


operator Run test unit - container test 3m11s

go run hack/e2e.go -v -test --test_args='--ginkgo.focus=operator\sRun\stest\sunit\s\-\scontainer\stest$'
t v0.1.0
go: finding github.com/cpu/goacmedns v0.0.1
go: finding github.com/prometheus/procfs v0.0.2
go: finding github.com/alecthomas/template v0.0.0-20190718012654-fb15b899a751
go: finding github.com/mattn/go-isatty v0.0.3
go: finding golang.org/x/tools v0.0.0-20180221164845-07fd8470d635
go: finding github.com/go-kit/kit v0.8.0
go: finding github.com/alecthomas/units v0.0.0-20190717042225-c3de453c63f4
go: finding github.com/Azure/go-autorest/autorest/adal v0.1.0
go: finding github.com/spf13/viper v1.3.2
go: finding github.com/beorn7/perks v1.0.0
go: finding golang.org/x/net v0.0.0-20190228165749-92fc7df08ae7
go: finding golang.org/x/tools v0.0.0-20180828015842-6cd1fcedba52
go: finding github.com/prometheus/procfs v0.0.0-20190117184657-bf6a532e95b1
go: finding k8s.io/client-go v0.0.0-20190620085101-78d2af792bab
go: finding github.com/gophercloud/gophercloud v0.0.0-20190126172459-c818fa66e4c8
go: finding golang.org/x/crypto v0.0.0-20181025213731-e84da0312774
go: finding github.com/dgrijalva/jwt-go v0.0.0-20160705203006-01aeca54ebda
go: finding github.com/hashicorp/golang-lru v0.5.1
go: finding github.com/prometheus/procfs v0.0.0-20181005140218-185b4288413d
go: finding k8s.io/utils v0.0.0-20190221042446-c2654d5206da
go: finding github.com/gregjones/httpcache v0.0.0-20170728041850-787624de3eb7
go: finding github.com/beorn7/perks v0.0.0-20180321164747-3a771d992973
go: finding github.com/imdario/mergo v0.3.5
go: finding github.com/peterbourgon/diskv v2.0.1+incompatible
go: finding github.com/Azure/go-autorest v11.1.2+incompatible
go: finding github.com/google/btree v0.0.0-20160524151835-7d79101e329e
go: finding golang.org/x/time v0.0.0-20161028155119-f51c12702a4d
go: finding golang.org/x/oauth2 v0.0.0-20190402181905-9f3314589c9a
go: finding github.com/russross/blackfriday v1.5.2
go: github.com/spf13/viper@v1.4.0: unknown revision v1.4.0
go: github.com/spf13/viper@v1.3.2: unknown revision v1.3.2
go: github.com/fatih/structs@v1.1.0: unknown revision v1.1.0
go: error loading module requirements
make: *** [test] Error 1

				from junit_operator.xml

Filter through log files


Show 2 Passed Tests

Error lines from build-log.txt

... skipping 550 lines ...