ResultFAILURE
Tests 1 failed / 11 succeeded
Started2020-07-16 13:30
Elapsed1h8m
Work namespaceci-op-4tvnh4b2
Refs master:9c1eabe7
40:7d924b56
pod764e6d69-c768-11ea-a402-0a580a81042c
repoopenshift/elasticsearch-proxy
revision1

Test Failures


operator Run template elasticsearch-operator-e2e - elasticsearch-operator-e2e container test 20m31s

go run hack/e2e.go -v -test --test_args='--ginkgo.focus=operator\sRun\stemplate\selasticsearch\-operator\-e2e\s\-\selasticsearch\-operator\-e2e\scontainer\stest$'
"result":"created","_shards":{"total":2,"successful":1,"failed":0},"_seq_no":0,"_primary_term":1}201'
[INFO] Passed
[INFO] Running cleanup
/tmp/artifacts/logging-artifacts/test-657-im-block-autocreate-for-write-suffix.sh/admin-ca
/tmp/artifacts/logging-artifacts/test-657-im-block-autocreate-for-write-suffix.sh/admin-cert
/tmp/artifacts/logging-artifacts/test-657-im-block-autocreate-for-write-suffix.sh/admin-key
/tmp/artifacts/logging-artifacts/test-657-im-block-autocreate-for-write-suffix.sh/elasticsearch.crt
/tmp/artifacts/logging-artifacts/test-657-im-block-autocreate-for-write-suffix.sh/elasticsearch.key
/tmp/artifacts/logging-artifacts/test-657-im-block-autocreate-for-write-suffix.sh/logging-es.crt
/tmp/artifacts/logging-artifacts/test-657-im-block-autocreate-for-write-suffix.sh/logging-es.key
Error from server (NotFound): configmaps "fluentd" not found
warning: Immediate deletion does not wait for confirmation that the running resource has been terminated. The resource may continue to run on the cluster indefinitely.
namespace "e2e-test-25299" force deleted
warning: Immediate deletion does not wait for confirmation that the running resource has been terminated. The resource may continue to run on the cluster indefinitely.
namespace "openshift-operators-redhat" force deleted
[INFO] ===========================================================
[INFO] e2e hack/testing-olm/test-657-im-block-autocreate-for-write-suffix.sh succeeded at Thu Jul 16 14:28:31 UTC 2020
[INFO] ===========================================================
error: the server could not find the requested resource
  404 page not found
error: the server could not find the requested resource
  404 page not found
error: the server could not find the requested resource
  404 page not found
error: the server could not find the requested resource
  404 page not found
error: the server could not find the requested resource
  404 page not found
error: the server could not find the requested resource
  404 page not found
make: *** [test-e2e-olm] Error 1

				from junit_operator.xml

Filter through log files


Show 11 Passed Tests

Error lines from build-log.txt

... skipping 569 lines ...
[ERROR] ============= FAILED FAILED ============= 
[ERROR] e2e hack/testing-olm/test-001-operator-sdk-e2e.sh failed at Thu Jul 16 14:24:06 UTC 2020
[ERROR] ============= FAILED FAILED ============= 
... skipping 709 lines ...