ResultFAILURE
Tests 2 failed / 12 succeeded
Started2020-04-24 11:09
Elapsed1h18m
Work namespaceci-op-vd8cjyl1
Refs ocm-4.4.0:ee7e42c2
955:8f499a5d
pod090e2311-861c-11ea-b991-0a58ac1079a2
repoopenshift/hive
revision1

Test Failures


job initialize 0.00s

go run hack/e2e.go -v -test --test_args='--ginkgo.focus=job\sinitialize$'
could not run steps: step e2e failed: template pod "e2e" failed: the pod ci-op-vd8cjyl1/e2e failed after 1h8m38s (failed containers: test): ContainerFailed one or more containers exited

Container test exited with code 2, reason Error
---
t.io/hive created
make[1]: Leaving directory `/go/src/github.com/openshift/hive'
Running post-deploy tests
make[1]: Entering directory `/go/src/github.com/openshift/hive'
go test  -timeout 0 -count=1 ./test/e2e/postdeploy/...
time="2020-04-24T11:54:25Z" level=info msg="Registering validation REST resource" group=admission.hive.openshift.io resource=dnszonevalidator version=v1
time="2020-04-24T11:54:25Z" level=info msg="Waiting for deployment" deployment=hive-e2e/hiveadmission
--- FAIL: TestAdmission (600.01s)
    admission_test.go:26: Failed waiting for hive admission deployment: timed out waiting for deployment hive-e2e/hiveadmission
FAIL
FAIL	github.com/openshift/hive/test/e2e/postdeploy/admission	600.075s
time="2020-04-24T11:54:25Z" level=info msg="Waiting for deployment" deployment=hive-e2e/hive-controllers
--- FAIL: TestHiveControllersDeployment (600.01s)
    manager_test.go:28: Failed waiting for hive controllers deployment: timed out waiting for deployment hive-e2e/hive-controllers
time="2020-04-24T12:04:25Z" level=info msg="Waiting for deployment" deployment=hive-e2e/hive-controllers
W0424 12:09:55.930198   27998 reflector.go:289] github.com/openshift/hive/test/e2e/common/deployment.go:61: watch of *v1.Deployment ended with: too old resource version: 22080 (22543)
--- FAIL: TestHiveControllersMetrics (600.00s)
    manager_test.go:28: Failed waiting for hive controllers deployment: timed out waiting for deployment hive-e2e/hive-controllers
FAIL
FAIL	github.com/openshift/hive/test/e2e/postdeploy/hivecontroller	1200.075s
ok  	github.com/openshift/hive/test/e2e/postdeploy/operator	8.584s
FAIL
make[1]: *** [test-e2e-postdeploy] Error 1
make[1]: Leaving directory `/go/src/github.com/openshift/hive'


Deleting ClusterDeployment hive-afecdb9d-f96d-450d-8b0a-723ad1f98b53
Error from server (NotFound): clusterdeployments.hive.openshift.io "hive-afecdb9d-f96d-450d-8b0a-723ad1f98b53" not found
stat /contrib/cmd/waitforjob/main.go: no such file or directory
Waiting for uninstall job failed
make: *** [test-e2e] Error 1
---
				from junit_job.xml

Find e2e mentions in log files


operator Run template e2e - e2e container test 23m6s

go run hack/e2e.go -v -test --test_args='--ginkgo.focus=operator\sRun\stemplate\se2e\s\-\se2e\scontainer\stest$'
t.io/hive created
make[1]: Leaving directory `/go/src/github.com/openshift/hive'
Running post-deploy tests
make[1]: Entering directory `/go/src/github.com/openshift/hive'
go test  -timeout 0 -count=1 ./test/e2e/postdeploy/...
time="2020-04-24T11:54:25Z" level=info msg="Registering validation REST resource" group=admission.hive.openshift.io resource=dnszonevalidator version=v1
time="2020-04-24T11:54:25Z" level=info msg="Waiting for deployment" deployment=hive-e2e/hiveadmission
--- FAIL: TestAdmission (600.01s)
    admission_test.go:26: Failed waiting for hive admission deployment: timed out waiting for deployment hive-e2e/hiveadmission
FAIL
FAIL	github.com/openshift/hive/test/e2e/postdeploy/admission	600.075s
time="2020-04-24T11:54:25Z" level=info msg="Waiting for deployment" deployment=hive-e2e/hive-controllers
--- FAIL: TestHiveControllersDeployment (600.01s)
    manager_test.go:28: Failed waiting for hive controllers deployment: timed out waiting for deployment hive-e2e/hive-controllers
time="2020-04-24T12:04:25Z" level=info msg="Waiting for deployment" deployment=hive-e2e/hive-controllers
W0424 12:09:55.930198   27998 reflector.go:289] github.com/openshift/hive/test/e2e/common/deployment.go:61: watch of *v1.Deployment ended with: too old resource version: 22080 (22543)
--- FAIL: TestHiveControllersMetrics (600.00s)
    manager_test.go:28: Failed waiting for hive controllers deployment: timed out waiting for deployment hive-e2e/hive-controllers
FAIL
FAIL	github.com/openshift/hive/test/e2e/postdeploy/hivecontroller	1200.075s
ok  	github.com/openshift/hive/test/e2e/postdeploy/operator	8.584s
FAIL
make[1]: *** [test-e2e-postdeploy] Error 1
make[1]: Leaving directory `/go/src/github.com/openshift/hive'


Deleting ClusterDeployment hive-afecdb9d-f96d-450d-8b0a-723ad1f98b53
Error from server (NotFound): clusterdeployments.hive.openshift.io "hive-afecdb9d-f96d-450d-8b0a-723ad1f98b53" not found
stat /contrib/cmd/waitforjob/main.go: no such file or directory
Waiting for uninstall job failed
make: *** [test-e2e] Error 1

				from junit_operator.xml

Filter through log files


Show 12 Passed Tests