ResultFAILURE
Tests 1 failed / 54 succeeded
Started2020-08-18 07:43
Elapsed1h29m
Work namespaceci-op-tgl210yx
Refs release-v0.13.0:0148a46a
694:88abcea6
pod8cc98c6e-e126-11ea-a7cf-0a580a83031a
repoopenshift/knative-eventing
revision1

Test Failures


operator Run template e2e-aws-ocp-44 - e2e-aws-ocp-44 container test 32m21s

go run hack/e2e.go -v -test --test_args='--ginkgo.focus=operator\sRun\stemplate\se2e\-aws\-ocp\-44\s\-\se2e\-aws\-ocp\-44\scontainer\stest$'
ns.admissionregistration.k8s.io --all-namespaces
+ echo '>>> Details'
+ [[ validatingwebhookconfigurations.admissionregistration.k8s.io == \s\e\c\r\e\t\s ]]
+ kubectl get validatingwebhookconfigurations.admissionregistration.k8s.io --all-namespaces -o yaml
+ for crd in '$(kubectl api-resources --verbs=list -o name | sort)'
++ kubectl get volumeattachments.storage.k8s.io --all-namespaces --no-headers
++ wc -l
+ local count=0
>>> volumeattachments.storage.k8s.io (0 objects)
+ echo '>>> volumeattachments.storage.k8s.io (0 objects)'
+ [[ 0 > 0 ]]
+ for crd in '$(kubectl api-resources --verbs=list -o name | sort)'
++ kubectl get volumesnapshotclasses.snapshot.storage.k8s.io --all-namespaces --no-headers
++ wc -l
+ local count=0
>>> volumesnapshotclasses.snapshot.storage.k8s.io (0 objects)
+ echo '>>> volumesnapshotclasses.snapshot.storage.k8s.io (0 objects)'
+ [[ 0 > 0 ]]
+ for crd in '$(kubectl api-resources --verbs=list -o name | sort)'
++ kubectl get volumesnapshotcontents.snapshot.storage.k8s.io --all-namespaces --no-headers
++ wc -l
+ local count=0
>>> volumesnapshotcontents.snapshot.storage.k8s.io (0 objects)
+ echo '>>> volumesnapshotcontents.snapshot.storage.k8s.io (0 objects)'
+ [[ 0 > 0 ]]
+ for crd in '$(kubectl api-resources --verbs=list -o name | sort)'
++ kubectl get volumesnapshots.snapshot.storage.k8s.io --all-namespaces --no-headers
++ wc -l
+ local count=0
>>> volumesnapshots.snapshot.storage.k8s.io (0 objects)
+ echo '>>> volumesnapshots.snapshot.storage.k8s.io (0 objects)'
+ [[ 0 > 0 ]]
+ function_exists dump_extra_cluster_state
++ type -t dump_extra_cluster_state
+ [[ '' == \f\u\n\c\t\i\o\n ]]
+ echo '***************************************'
***************************************
***         E2E TEST FAILED         ***
+ echo '***         E2E TEST FAILED         ***'
+ echo '***     End of information dump     ***'
***     End of information dump     ***
***************************************
+ echo '***************************************'
+ ((  failed  ))
+ exit 1
make: *** [test-e2e] Error 1

				from junit_operator.xml

Filter through log files


Show 54 Passed Tests

Error lines from build-log.txt

... skipping 2766 lines ...